Build #1,374

Build result summary

Details

Completed
Duration
2 minutes
Labels
None
Agent
bamboo-09.af.pivotal.io
Revision
1d7d3cd9e071d121d7128b61eac6794c232393fd 1d7d3cd9e071d121d7128b61eac6794c232393fd
Total tests
317
Fixed in
#1376 (Changes by Stephane Maldini <smaldini@pivotal.io>)

Responsible

No one has taken responsibility for this failure

Code commits

Author Commit Message Commit date
Stephane Maldini <smaldini@pivotal.io> Stephane Maldini <smaldini@pivotal.io> 1d7d3cd9e071d121d7128b61eac6794c232393fd 1d7d3cd9e071d121d7128b61eac6794c232393fd fix #484 : Application Protocol is not enabled by HttpServer#secure

Tests

New test failures 3
Status Test View job Duration
Collapse Failed SslProviderTests testSslConfigurationProtocolHttp11_1 History
Netty < 1 sec
java.lang.AssertionError: java.lang.AssertionError
java.lang.AssertionError
	at org.junit.Assert.fail(Assert.java:92)
	at org.junit.Assert.assertTrue(Assert.java:43)
	at org.junit.Assert.assertTrue(Assert.java:54)
	at reactor.netty.tcp.SslProviderTests.testSslConfigurationProtocolHttp11_1(SslProviderTests.java:71)
	at sun.reflect.NativeMethodAccessorImpl.invoke0(Native Method)
	at sun.reflect.NativeMethodAccessorImpl.invoke(NativeMethodAccessorImpl.java:62)
(44 more lines...)
Collapse Failed SslProviderTests testSslConfigurationProtocolHttp11_2 History
Netty < 1 sec
java.lang.AssertionError: java.lang.AssertionError
java.lang.AssertionError
	at org.junit.Assert.fail(Assert.java:92)
	at org.junit.Assert.assertTrue(Assert.java:43)
	at org.junit.Assert.assertTrue(Assert.java:54)
	at reactor.netty.tcp.SslProviderTests.testSslConfigurationProtocolHttp11_2(SslProviderTests.java:82)
	at sun.reflect.NativeMethodAccessorImpl.invoke0(Native Method)
	at sun.reflect.NativeMethodAccessorImpl.invoke(NativeMethodAccessorImpl.java:62)
(44 more lines...)
Collapse Failed SslProviderTests testProtocolHttp11SslConfiguration History
Netty < 1 sec
java.lang.AssertionError: java.lang.AssertionError
java.lang.AssertionError
	at org.junit.Assert.fail(Assert.java:92)
	at org.junit.Assert.assertTrue(Assert.java:43)
	at org.junit.Assert.assertTrue(Assert.java:54)
	at reactor.netty.tcp.SslProviderTests.testProtocolHttp11SslConfiguration(SslProviderTests.java:61)
	at sun.reflect.NativeMethodAccessorImpl.invoke0(Native Method)
	at sun.reflect.NativeMethodAccessorImpl.invoke(NativeMethodAccessorImpl.java:62)
(44 more lines...)