Build #2,126

Build: #2126 failed Rebuilt by Simon Basle

Build result summary

Details

Completed
Duration
5 minutes
Labels
None
Agent
bamboo-08.af.pivotal.io
Revisions
reactor-core
28458e3723e52435cac7827a1dcdae535d0ffb42 28458e3723e52435cac7827a1dcdae535d0ffb42
reactor-test
190c8ede58befa573d4a50db332b0a64503dc64b 190c8ede58befa573d4a50db332b0a64503dc64b
Total tests
4161
Fixed in
#2130 (Manual run by Simon Basle)
Number of retries
1

Responsible

Code commits

reactor-core
Author Commit Message Commit date
Simon Basle Simon Basle 28458e3723e52435cac7827a1dcdae535d0ffb42 28458e3723e52435cac7827a1dcdae535d0ffb42 fix #959 Test that assertNext + subscribeOn work
This issue is actually fixed by #992.

Configuration changes

Plan configuration has changed since the last successful build. See the plan audit log for more details.

Tests

New test failures 1
Status Test View job Duration
Collapse Failed FluxGroupByTest twoGroupsFullAsyncFullHide History
Core 5 secs
java.lang.AssertionError: java.lang.AssertionError: No complete or error signal before timeout
java.lang.AssertionError: No complete or error signal before timeout
	at reactor.test.subscriber.AssertSubscriber.await(AssertSubscriber.java:701)
	at reactor.core.publisher.FluxGroupByTest.twoGroupsFullAsyncFullHide(FluxGroupByTest.java:667)
	at sun.reflect.NativeMethodAccessorImpl.invoke0(Native Method)
	at sun.reflect.NativeMethodAccessorImpl.invoke(NativeMethodAccessorImpl.java:62)
	at sun.reflect.DelegatingMethodAccessorImpl.invoke(DelegatingMethodAccessorImpl.java:43)
	at java.lang.reflect.Method.invoke(Method.java:498)
(42 more lines...)