Build #2,494

Build result summary

Details

Completed
Duration
6 minutes
Labels
None
Revision
4f2bc7a72633446039262d9cb70f4af330024249 4f2bc7a72633446039262d9cb70f4af330024249
Total tests
4987
Fixed in
#2497 (Changes by Stephane Maldini <smaldini@pivotal.io>)

Tests

Responsible

No one has taken responsibility for this failure

Code commits

Author Commit Message Commit date
Stephane Maldini <smaldini@pivotal.io> Stephane Maldini <smaldini@pivotal.io> 4f2bc7a72633446039262d9cb70f4af330024249 4f2bc7a72633446039262d9cb70f4af330024249 Do not lookup or trigger context hook for error sources

Tests

New test failures 4
Status Test View job Duration
Collapse Failed FluxSourceTest fluxError History
Core < 1 sec
java.lang.AssertionError: java.lang.AssertionError: expectation "expectErrorMessage" failed (expected error message: "test"; actual message: java.lang.Exception: test)
java.lang.AssertionError: expectation "expectErrorMessage" failed (expected error message: "test"; actual message: java.lang.Exception: test)
	at reactor.test.MessageFormatter.assertionError(MessageFormatter.java:115)
	at reactor.test.MessageFormatter.failPrefix(MessageFormatter.java:104)
	at reactor.test.MessageFormatter.fail(MessageFormatter.java:73)
	at reactor.test.MessageFormatter.failOptional(MessageFormatter.java:88)
	at reactor.test.DefaultStepVerifierBuilder.lambda$expectErrorMessage$7(DefaultStepVerifierBuilder.java:386)
	at reactor.test.DefaultStepVerifierBuilder$SignalEvent.test(DefaultStepVerifierBuilder.java:2143)
(55 more lines...)
Collapse Failed FluxSourceTest errorPropagate History
Core < 1 sec
java.lang.AssertionError: java.lang.AssertionError: expectation "expectErrorMessage" failed (expected error message: "test"; actual message: java.lang.Error: test)
java.lang.AssertionError: expectation "expectErrorMessage" failed (expected error message: "test"; actual message: java.lang.Error: test)
	at reactor.test.MessageFormatter.assertionError(MessageFormatter.java:115)
	at reactor.test.MessageFormatter.failPrefix(MessageFormatter.java:104)
	at reactor.test.MessageFormatter.fail(MessageFormatter.java:73)
	at reactor.test.MessageFormatter.failOptional(MessageFormatter.java:88)
	at reactor.test.DefaultStepVerifierBuilder.lambda$expectErrorMessage$7(DefaultStepVerifierBuilder.java:386)
	at reactor.test.DefaultStepVerifierBuilder$SignalEvent.test(DefaultStepVerifierBuilder.java:2143)
(55 more lines...)
Collapse Failed FluxSwitchOnFirstTest shouldReturnNormallyIfExceptionIsThrownOnErrorDuringSwitching History
Core < 1 sec
java.util.NoSuchElementException: java.util.NoSuchElementException
java.util.NoSuchElementException
	at java.util.concurrent.ConcurrentLinkedQueue$Itr.next(ConcurrentLinkedQueue.java:704)
	at reactor.core.publisher.FluxSwitchOnFirstTest.lambda$shouldReturnNormallyIfExceptionIsThrownOnErrorDuringSwitching$93(FluxSwitchOnFirstTest.java:867)
	at reactor.test.DefaultStepVerifierBuilder$DefaultStepVerifierAssertions.hasOperatorErrorsSatisfying(DefaultStepVerifierBuilder.java:2019)
	at reactor.core.publisher.FluxSwitchOnFirstTest.shouldReturnNormallyIfExceptionIsThrownOnErrorDuringSwitching(FluxSwitchOnFirstTest.java:864)
	at sun.reflect.NativeMethodAccessorImpl.invoke0(Native Method)
	at sun.reflect.NativeMethodAccessorImpl.invoke(NativeMethodAccessorImpl.java:62)
(43 more lines...)
Collapse Failed MonoSourceTest errorPropagate History
Core < 1 sec
java.lang.AssertionError: java.lang.AssertionError: expectation "expectErrorMessage" failed (expected error message: "test"; actual message: java.lang.Error: test)
java.lang.AssertionError: expectation "expectErrorMessage" failed (expected error message: "test"; actual message: java.lang.Error: test)
	at reactor.test.MessageFormatter.assertionError(MessageFormatter.java:115)
	at reactor.test.MessageFormatter.failPrefix(MessageFormatter.java:104)
	at reactor.test.MessageFormatter.fail(MessageFormatter.java:73)
	at reactor.test.MessageFormatter.failOptional(MessageFormatter.java:88)
	at reactor.test.DefaultStepVerifierBuilder.lambda$expectErrorMessage$7(DefaultStepVerifierBuilder.java:386)
	at reactor.test.DefaultStepVerifierBuilder$SignalEvent.test(DefaultStepVerifierBuilder.java:2143)
(55 more lines...)