Build #2,495

Build result summary

Details

Completed
Duration
6 minutes
Labels
None
Revision
b6f4d2917c109a3352d4be1a2361012ac89d8042 b6f4d2917c109a3352d4be1a2361012ac89d8042
Total tests
5399
Failing since
#2494 (Changes by Stephane Maldini <smaldini@pivotal.io>)
Fixed in
#2497 (Changes by Stephane Maldini <smaldini@pivotal.io>)

Responsible

This build has been failing since #2494
No one has taken responsibility

Code commits

Author Commit Message Commit date
Stephane Maldini <smaldini@pivotal.io> Stephane Maldini <smaldini@pivotal.io> b6f4d2917c109a3352d4be1a2361012ac89d8042 b6f4d2917c109a3352d4be1a2361012ac89d8042 Unwrap Throwable when fusing as scalar

Tests

New test failures 5
Status Test View job Duration
Collapse Failed StepVerifierAssertionsTests assertOperatorErrorFailureWrongMessage History
Core < 1 sec
java.lang.AssertionError: java.lang.AssertionError: 
Expecting message:
 <"Expected operator error with message <"boom2">, was <"boom1">.">
but was:
 <"Expected exactly one operator error, 0 found.">
java.lang.AssertionError: 
Expecting message:
 <"Expected operator error with message <"boom2">, was <"boom1">.">
(50 more lines...)
Collapse Failed StepVerifierAssertionsTests assertOperatorErrorAllPass History
Core < 1 sec
java.lang.AssertionError: java.lang.AssertionError: Expected at least 1 operator error, none found.
java.lang.AssertionError: Expected at least 1 operator error, none found.
	at reactor.test.MessageFormatter.assertionError(MessageFormatter.java:115)
	at reactor.test.DefaultStepVerifierBuilder$DefaultStepVerifierAssertions.satisfies(DefaultStepVerifierBuilder.java:1756)
	at reactor.test.DefaultStepVerifierBuilder$DefaultStepVerifierAssertions.hasOperatorErrors(DefaultStepVerifierBuilder.java:1939)
	at reactor.test.StepVerifierAssertionsTests.assertOperatorErrorAllPass(StepVerifierAssertionsTests.java:440)
	at sun.reflect.NativeMethodAccessorImpl.invoke0(Native Method)
	at sun.reflect.NativeMethodAccessorImpl.invoke(NativeMethodAccessorImpl.java:62)
(45 more lines...)
Collapse Failed StepVerifierAssertionsTests assertOperatorErrorFailureWrongMatch History
Core < 1 sec
java.lang.AssertionError: java.lang.AssertionError: 
Expecting message:
 <"Expected operator error matching the given predicate, did not match: <[Optional[java.lang.IllegalStateException: boom1],Optional.empty]>.">
but was:
 <"Expected exactly one operator error, 0 found.">
java.lang.AssertionError: 
Expecting message:
 <"Expected operator error matching the given predicate, did not match: <[Optional[java.lang.IllegalStateException: boom1],Optional.empty]>.">
(50 more lines...)
Collapse Failed StepVerifierAssertionsTests assertOperatorErrorFailureWrongContains History
Core < 1 sec
java.lang.AssertionError: java.lang.AssertionError: 
Expecting message:
 <"Expected operator error with message containing <"foo">, was <"boom1">.">
but was:
 <"Expected exactly one operator error, 0 found.">
java.lang.AssertionError: 
Expecting message:
 <"Expected operator error with message containing <"foo">, was <"boom1">.">
(50 more lines...)
Collapse Failed StepVerifierAssertionsTests assertOperatorErrorFailureWrongType History
Core < 1 sec
java.lang.AssertionError: java.lang.AssertionError: 
Expecting message:
 <"Expected operator error to be of type java.lang.IllegalArgumentException, was java.lang.IllegalStateException.">
but was:
 <"Expected exactly one operator error, 0 found.">
java.lang.AssertionError: 
Expecting message:
 <"Expected operator error to be of type java.lang.IllegalArgumentException, was java.lang.IllegalStateException.">
(50 more lines...)
Fixed tests 4
Status Test Failing since View job Duration
Successful FluxSourceTest fluxError History
Failing since build #2494 (Changes by Stephane Maldini <smaldini@pivotal.io>) Core < 1 sec
Successful FluxSourceTest errorPropagate History
Failing since build #2494 (Changes by Stephane Maldini <smaldini@pivotal.io>) Core < 1 sec
Successful FluxSwitchOnFirstTest shouldReturnNormallyIfExceptionIsThrownOnErrorDuringSwitching History
Failing since build #2494 (Changes by Stephane Maldini <smaldini@pivotal.io>) Core < 1 sec
Successful MonoSourceTest errorPropagate History
Failing since build #2494 (Changes by Stephane Maldini <smaldini@pivotal.io>) Core < 1 sec