Build #2,496

Build result summary

Details

Completed
Duration
6 minutes
Labels
None
Revision
fe4508beee73befb9073ebfd9e027c3b582276ec fe4508beee73befb9073ebfd9e027c3b582276ec
Total tests
5399
Failing since
#2494 (Changes by Stephane Maldini <smaldini@pivotal.io>)
Fixed in
#2497 (Changes by Stephane Maldini <smaldini@pivotal.io>)

Responsible

This build has been failing since #2494
No one has taken responsibility

Code commits

Author Commit Message Commit date
Stephane Maldini <smaldini@pivotal.io> Stephane Maldini <smaldini@pivotal.io> fe4508beee73befb9073ebfd9e027c3b582276ec fe4508beee73befb9073ebfd9e027c3b582276ec Update error tests after Flux/Mono.error update

Tests

Existing test failures 1
Status Test Failing since View job Duration
java.lang.AssertionError: java.lang.AssertionError: 
Expecting message:
 <"Expected operator error matching the given predicate, did not match: <[Optional[java.lang.IllegalStateException: boom1],Optional[test]>.">
but was:
 <"Expected operator error matching the given predicate, did not match: <[Optional[java.lang.IllegalStateException: boom1],Optional[test]]>.">
java.lang.AssertionError: 
Expecting message:
 <"Expected operator error matching the given predicate, did not match: <[Optional[java.lang.IllegalStateException: boom1],Optional[test]>.">
(50 more lines...)
Fixed tests 4
Status Test Failing since View job Duration
Successful StepVerifierAssertionsTests assertOperatorErrorFailureWrongMessage History
Failing since build #2495 (Changes by Stephane Maldini <smaldini@pivotal.io>) Core < 1 sec
Successful StepVerifierAssertionsTests assertOperatorErrorFailureWrongContains History
Failing since build #2495 (Changes by Stephane Maldini <smaldini@pivotal.io>) Core < 1 sec
Successful StepVerifierAssertionsTests assertOperatorErrorAllPass History
Failing since build #2495 (Changes by Stephane Maldini <smaldini@pivotal.io>) Core < 1 sec
Successful StepVerifierAssertionsTests assertOperatorErrorFailureWrongType History
Failing since build #2495 (Changes by Stephane Maldini <smaldini@pivotal.io>) Core < 1 sec