Build #2,507

Build result summary

Details

Completed
Duration
6 minutes
Labels
None
Revision
26a1511f679c63568d47cbed96451d62d7ff9492 26a1511f679c63568d47cbed96451d62d7ff9492
Total tests
4993
Failing since
#2506 (Changes by Taeho Kim <dittos@gmail.com>)
Fixed in
#2510 (Changes by Simon Basle)

Tests

Responsible

This build has been failing since #2506
No one has taken responsibility

Code commits

Author Commit Message Commit date
Stephane Maldini <smaldini@pivotal.io> Stephane Maldini <smaldini@pivotal.io> 26a1511f679c63568d47cbed96451d62d7ff9492 26a1511f679c63568d47cbed96451d62d7ff9492 fix #1719 Fix a memory barrier regression introduced in MonoSubscriber
Signed-off-by: Stephane Maldini <smaldini@pivotal.io>

Tests

Existing test failures 1
Status Test Failing since View job Duration
java.lang.AssertionError: java.lang.AssertionError: [active in last rounds] 
Expecting:
 <10>
to be less than:
 <10> 
java.lang.AssertionError: [active in last rounds] 
Expecting:
 <10>
(51 more lines...)