Build #2,508

Build: #2508 failed Code changes detected

Build result summary

Details

Completed
Duration
6 minutes
Labels
None
Revision
a2b552269a8d0aea375bbfedc1b5123e84aa12cd a2b552269a8d0aea375bbfedc1b5123e84aa12cd
Total tests
4993
Failing since
#2506 (Changes by Taeho Kim <dittos@gmail.com>)
Fixed in
#2510 (Changes by Simon Basle)

Tests

Responsible

This build has been failing since #2506
No one has taken responsibility

Code commits

Author Commit Message Commit date
Stephane Maldini <smaldini@pivotal.io> Stephane Maldini <smaldini@pivotal.io> a2b552269a8d0aea375bbfedc1b5123e84aa12cd m a2b552269a8d0aea375bbfedc1b5123e84aa12cd Merge branch '3.2.x'
Stephane Maldini <smaldini@pivotal.io> Stephane Maldini <smaldini@pivotal.io> f47a803087378b30018b969b9c75296b4e549246 m f47a803087378b30018b969b9c75296b4e549246 fix #1719 Fix a memory barrier regression introduced in MonoSubscriber
Signed-off-by: Stephane Maldini <smaldini@pivotal.io>

Tests

Existing test failures 1
Status Test Failing since View job Duration
java.lang.AssertionError: java.lang.AssertionError: [active in last rounds] 
Expecting:
 <10>
to be less than:
 <10> 
java.lang.AssertionError: [active in last rounds] 
Expecting:
 <10>
(51 more lines...)