Build #2,509

Build: #2509 failed Changes by Simon Basle

Build result summary

Details

Completed
Duration
6 minutes
Labels
None
Revision
a0b332b99b25f98461536f01cc18e6b30319301a a0b332b99b25f98461536f01cc18e6b30319301a
Total tests
4997
Failing since
#2506 (Changes by Taeho Kim <dittos@gmail.com>)
Fixed in
#2510 (Changes by Simon Basle)

Tests

Responsible

This build has been failing since #2506
No one has taken responsibility

Code commits

Author Commit Message Commit date
Simon Basle Simon Basle a0b332b99b25f98461536f01cc18e6b30319301a a0b332b99b25f98461536f01cc18e6b30319301a Merge #1707 into 3.3
Simon Basle Simon Basle 545019bedd68a38655017daf6151ff440e4af226 m 545019bedd68a38655017daf6151ff440e4af226 fix #1707 Allow to chose a Scheduler for retryBackoff

Tests

Existing test failures 1
Status Test Failing since View job Duration
java.lang.AssertionError: java.lang.AssertionError: [active in last rounds] 
Expecting:
 <10>
to be less than:
 <10> 
java.lang.AssertionError: [active in last rounds] 
Expecting:
 <10>
(51 more lines...)