Build #2,536

Build result summary

Details

Completed
Duration
6 minutes
Labels
None
Agent
bamboo-16.af.pivotal.io
Revision
55666928c0deb9057fee35e7f6c9f5514a79922d 55666928c0deb9057fee35e7f6c9f5514a79922d
Total tests
5449
Fixed in
#2537 (Changes by Stephane Maldini <smaldini@pivotal.io>)
No failed tests found, a possible compilation error occurred.

Tests

Responsible

No one has taken responsibility for this failure

Code commits

Author Commit Message Commit date
Stephane Maldini <smaldini@pivotal.io> Stephane Maldini <smaldini@pivotal.io> 55666928c0deb9057fee35e7f6c9f5514a79922d 55666928c0deb9057fee35e7f6c9f5514a79922d fix #1764 Remove deprecated decorateExecutorService
Signed-off-by: Stephane Maldini <smaldini@pivotal.io>

Error summary for Core

The job generated some errors, drill down into the full build log for more details.

        at org.gradle.api.internal.tasks.execution.CatchExceptionTaskExecuter.execute(CatchExceptionTaskExecuter.java:36)
        at org.gradle.api.internal.tasks.execution.EventFiringTaskExecuter$1.executeTask(EventFiringTaskExecuter.java:73)
        at org.gradle.api.internal.tasks.execution.EventFiringTaskExecuter$1.call(EventFiringTaskExecuter.java:52)
        at org.gradle.api.internal.tasks.execution.EventFiringTaskExecuter$1.call(EventFiringTaskExecuter.java:49)
        at org.gradle.internal.operations.DefaultBuildOperationExecutor$CallableBuildOperationWorker.execute(DefaultBuildOperationExecutor.java:416)
        at org.gradle.internal.operations.DefaultBuildOperationExecutor$CallableBuildOperationWorker.execute(DefaultBuildOperationExecutor.java:406)
        at org.gradle.internal.operations.DefaultBuildOperationExecutor$1.execute(DefaultBuildOperationExecutor.java:165)
        at org.gradle.internal.operations.DefaultBuildOperationExecutor.execute(DefaultBuildOperationExecutor.java:250)
        at org.gradle.internal.operations.DefaultBuildOperationExecutor.execute(DefaultBuildOperationExecutor.java:158)
        at org.gradle.internal.operations.DefaultBuildOperationExecutor.call(DefaultBuildOperationExecutor.java:102)
        at org.gradle.internal.operations.DelegatingBuildOperationExecutor.call(DelegatingBuildOperationExecutor.java:36)
        at org.gradle.api.internal.tasks.execution.EventFiringTaskExecuter.execute(EventFiringTaskExecuter.java:49)
        at org.gradle.execution.plan.LocalTaskNodeExecutor.execute(LocalTaskNodeExecutor.java:43)
        at org.gradle.execution.taskgraph.DefaultTaskExecutionGraph$InvokeNodeExecutorsAction.execute(DefaultTaskExecutionGraph.java:355)
        at org.gradle.execution.taskgraph.DefaultTaskExecutionGraph$InvokeNodeExecutorsAction.execute(DefaultTaskExecutionGraph.java:343)
        at org.gradle.execution.taskgraph.DefaultTaskExecutionGraph$BuildOperationAwareExecutionAction.execute(DefaultTaskExecutionGraph.java:336)
        at org.gradle.execution.taskgraph.DefaultTaskExecutionGraph$BuildOperationAwareExecutionAction.execute(DefaultTaskExecutionGraph.java:322)
        at org.gradle.execution.plan.DefaultPlanExecutor$ExecutorWorker$1.execute(DefaultPlanExecutor.java:134)
        at org.gradle.execution.plan.DefaultPlanExecutor$ExecutorWorker$1.execute(DefaultPlanExecutor.java:129)
        at org.gradle.execution.plan.DefaultPlanExecutor$ExecutorWorker.execute(DefaultPlanExecutor.java:202)
        at org.gradle.execution.plan.DefaultPlanExecutor$ExecutorWorker.executeNextNode(DefaultPlanExecutor.java:193)
        at org.gradle.execution.plan.DefaultPlanExecutor$ExecutorWorker.run(DefaultPlanExecutor.java:129)
        at org.gradle.internal.concurrent.ExecutorPolicy$CatchAndRecordFailures.onExecute(ExecutorPolicy.java:63)
        at org.gradle.internal.concurrent.ManagedExecutorImpl$1.run(ManagedExecutorImpl.java:46)
        at org.gradle.internal.concurrent.ThreadFactoryImpl$ManagedThreadRunnable.run(ThreadFactoryImpl.java:55)
Caused by: org.gradle.workers.internal.DefaultWorkerExecutor$WorkExecutionException: A failure occurred while executing Comparing [reactor-core-3.3.0.BUILD-SNAPSHOT.jar] with [reactor-core-3.2.0.RELEASE.jar]
        at org.gradle.workers.internal.DefaultWorkerExecutor$WorkerExecution.waitForCompletion(DefaultWorkerExecutor.java:285)
        at org.gradle.internal.work.DefaultAsyncWorkTracker.waitForItemsAndGatherFailures(DefaultAsyncWorkTracker.java:115)
        at org.gradle.internal.work.DefaultAsyncWorkTracker.access$000(DefaultAsyncWorkTracker.java:34)
        at org.gradle.internal.work.DefaultAsyncWorkTracker$2.run(DefaultAsyncWorkTracker.java:83)
        at org.gradle.internal.Factories$1.create(Factories.java:25)
        at org.gradle.internal.work.DefaultWorkerLeaseService.withoutLocks(DefaultWorkerLeaseService.java:254)
        at org.gradle.internal.work.DefaultWorkerLeaseService.withoutProjectLock(DefaultWorkerLeaseService.java:165)
        at org.gradle.internal.work.DefaultWorkerLeaseService.withoutProjectLock(DefaultWorkerLeaseService.java:159)
        at org.gradle.internal.work.StopShieldingWorkerLeaseService.withoutProjectLock(StopShieldingWorkerLeaseService.java:90)
        at org.gradle.internal.work.DefaultAsyncWorkTracker.waitForCompletion(DefaultAsyncWorkTracker.java:79)
        at org.gradle.api.internal.tasks.execution.ExecuteActionsTaskExecuter$5.run(ExecuteActionsTaskExecuter.java:412)
        at org.gradle.internal.operations.DefaultBuildOperationExecutor$RunnableBuildOperationWorker.execute(DefaultBuildOperationExecutor.java:402)
        at org.gradle.internal.operations.DefaultBuildOperationExecutor$RunnableBuildOperationWorker.execute(DefaultBuildOperationExecutor.java:394)
        at org.gradle.internal.operations.DefaultBuildOperationExecutor$1.execute(DefaultBuildOperationExecutor.java:165)
        at org.gradle.internal.operations.DefaultBuildOperationExecutor.execute(DefaultBuildOperationExecutor.java:250)
        at org.gradle.internal.operations.DefaultBuildOperationExecutor.execute(DefaultBuildOperationExecutor.java:158)
        at org.gradle.internal.operations.DefaultBuildOperationExecutor.run(DefaultBuildOperationExecutor.java:92)
        at org.gradle.internal.operations.DelegatingBuildOperationExecutor.run(DelegatingBuildOperationExecutor.java:31)
        at org.gradle.api.internal.tasks.execution.ExecuteActionsTaskExecuter.executeAction(ExecuteActionsTaskExecuter.java:393)
        at org.gradle.api.internal.tasks.execution.ExecuteActionsTaskExecuter.executeActions(ExecuteActionsTaskExecuter.java:376)
        at org.gradle.api.internal.tasks.execution.ExecuteActionsTaskExecuter.access$200(ExecuteActionsTaskExecuter.java:80)
        at org.gradle.api.internal.tasks.execution.ExecuteActionsTaskExecuter$TaskExecution.execute(ExecuteActionsTaskExecuter.java:213)
        at org.gradle.internal.execution.steps.ExecuteStep.lambda$execute$1(ExecuteStep.java:33)
        at org.gradle.internal.execution.steps.ExecuteStep.execute(ExecuteStep.java:33)
        at org.gradle.internal.execution.steps.ExecuteStep.execute(ExecuteStep.java:26)
        at org.gradle.internal.execution.steps.CleanupOutputsStep.execute(CleanupOutputsStep.java:58)
        at org.gradle.internal.execution.steps.CleanupOutputsStep.execute(CleanupOutputsStep.java:35)
        at org.gradle.internal.execution.steps.ResolveInputChangesStep.execute(ResolveInputChangesStep.java:48)
        at org.gradle.internal.execution.steps.ResolveInputChangesStep.execute(ResolveInputChangesStep.java:33)
        at org.gradle.internal.execution.steps.CancelExecutionStep.execute(CancelExecutionStep.java:39)
        at org.gradle.internal.execution.steps.TimeoutStep.executeWithoutTimeout(TimeoutStep.java:73)
        at org.gradle.internal.execution.steps.TimeoutStep.execute(TimeoutStep.java:54)
        at org.gradle.internal.execution.steps.CatchExceptionStep.execute(CatchExceptionStep.java:35)
        at org.gradle.internal.execution.steps.CreateOutputsStep.execute(CreateOutputsStep.java:51)
        at org.gradle.internal.execution.steps.SnapshotOutputsStep.execute(SnapshotOutputsStep.java:45)
        at org.gradle.internal.execution.steps.SnapshotOutputsStep.execute(SnapshotOutputsStep.java:31)
        at org.gradle.internal.execution.steps.CacheStep.executeWithoutCache(CacheStep.java:201)
        at org.gradle.internal.execution.steps.CacheStep.execute(CacheStep.java:70)
        at org.gradle.internal.execution.steps.CacheStep.execute(CacheStep.java:45)
        at org.gradle.internal.execution.steps.BroadcastChangingOutputsStep.execute(BroadcastChangingOutputsStep.java:49)
        at org.gradle.internal.execution.steps.StoreSnapshotsStep.execute(StoreSnapshotsStep.java:43)
        at org.gradle.internal.execution.steps.StoreSnapshotsStep.execute(StoreSnapshotsStep.java:32)
        at org.gradle.internal.execution.steps.RecordOutputsStep.execute(RecordOutputsStep.java:38)
        at org.gradle.internal.execution.steps.RecordOutputsStep.execute(RecordOutputsStep.java:24)
        at org.gradle.internal.execution.steps.SkipUpToDateStep.executeBecause(SkipUpToDateStep.java:96)
        at org.gradle.internal.execution.steps.SkipUpToDateStep.lambda$execute$0(SkipUpToDateStep.java:89)
        at org.gradle.internal.execution.steps.SkipUpToDateStep.execute(SkipUpToDateStep.java:54)
        at org.gradle.internal.execution.steps.SkipUpToDateStep.execute(SkipUpToDateStep.java:38)
        at org.gradle.internal.execution.steps.ResolveChangesStep.execute(ResolveChangesStep.java:77)
        at org.gradle.internal.execution.steps.ResolveChangesStep.execute(ResolveChangesStep.java:37)
        at org.gradle.internal.execution.steps.legacy.MarkSnapshottingInputsFinishedStep.execute(MarkSnapshottingInputsFinishedStep.java:36)
        at org.gradle.internal.execution.steps.legacy.MarkSnapshottingInputsFinishedStep.execute(MarkSnapshottingInputsFinishedStep.java:26)
        at org.gradle.internal.execution.steps.ResolveCachingStateStep.execute(ResolveCachingStateStep.java:90)
        at org.gradle.internal.execution.steps.ResolveCachingStateStep.execute(ResolveCachingStateStep.java:48)
        at org.gradle.internal.execution.impl.DefaultWorkExecutor.execute(DefaultWorkExecutor.java:33)
        at org.gradle.api.internal.tasks.execution.ExecuteActionsTaskExecuter.execute(ExecuteActionsTaskExecuter.java:120)
        ... 35 more
Caused by: org.gradle.api.GradleException: Detected binary changes between reactor-core-3.3.0.BUILD-SNAPSHOT.jar and reactor-core-3.2.0.RELEASE.jar. See failure report at file:///opt/bamboo-home/xml-data/build-dir/REACTOR-RNEXT-JOB1/reactor-core/build/reports/japi.txt
        at me.champeau.gradle.japicmp.JApiCmpWorkerAction.generateOutput(JApiCmpWorkerAction.java:292)
        at me.champeau.gradle.japicmp.JApiCmpWorkerAction.run(JApiCmpWorkerAction.java:143)
        at org.gradle.workers.internal.DefaultWorkerServer.execute(DefaultWorkerServer.java:39)
        at org.gradle.workers.internal.WorkerDaemonServer.execute(WorkerDaemonServer.java:38)
        at org.gradle.process.internal.worker.request.WorkerAction.run(WorkerAction.java:111)
        at org.gradle.internal.dispatch.ReflectionDispatch.dispatch(ReflectionDispatch.java:35)
        at org.gradle.internal.dispatch.ReflectionDispatch.dispatch(ReflectionDispatch.java:24)
        at org.gradle.internal.remote.internal.hub.MessageHubBackedObjectConnection$DispatchWrapper.dispatch(MessageHubBackedObjectConnection.java:175)
        at org.gradle.internal.remote.internal.hub.MessageHubBackedObjectConnection$DispatchWrapper.dispatch(MessageHubBackedObjectConnection.java:157)
        at org.gradle.internal.remote.internal.hub.MessageHub$Handler.run(MessageHub.java:404)
        ... 3 more


* Get more help at https://help.gradle.org

BUILD FAILED in 6m 37s