Build #2,552

Build result summary

Details

Completed
Duration
4 minutes
Labels
None
Agent
bamboo-15.af.pivotal.io
Revision
f478ab30c1ba810d97ed31570829adb953406209 f478ab30c1ba810d97ed31570829adb953406209
Total tests
5076
Fixed in
#2555 (Changes by Stephane Maldini <smaldini@pivotal.io>)

Tests

Responsible

No one has taken responsibility for this failure

Code commits

Author Commit Message Commit date
Stephane Maldini <smaldini@pivotal.io> Stephane Maldini <smaldini@pivotal.io> f478ab30c1ba810d97ed31570829adb953406209 f478ab30c1ba810d97ed31570829adb953406209 More Summer cleaning - alloc saving
Signed-off-by: Stephane Maldini <smaldini@pivotal.io>

Tests

New test failures 3
Status Test View job Duration
Collapse Failed MonoMetricsFuseableTest subscribeToCompleteFuseable History
Core < 1 sec
java.lang.NullPointerException: java.lang.NullPointerException
java.lang.NullPointerException
	at reactor.core.publisher.MonoMetricsFuseableTest.lambda$subscribeToCompleteFuseable$5(MonoMetricsFuseableTest.java:337)
	at org.assertj.core.api.SoftAssertions.assertSoftly(SoftAssertions.java:158)
	at reactor.core.publisher.MonoMetricsFuseableTest.subscribeToCompleteFuseable(MonoMetricsFuseableTest.java:328)
	at sun.reflect.NativeMethodAccessorImpl.invoke0(Native Method)
	at sun.reflect.NativeMethodAccessorImpl.invoke(NativeMethodAccessorImpl.java:62)
	at sun.reflect.DelegatingMethodAccessorImpl.invoke(DelegatingMethodAccessorImpl.java:43)
(44 more lines...)
Collapse Failed MonoMetricsFuseableTest subscribeToErrorFuseable History
Core < 1 sec
java.lang.NullPointerException: java.lang.NullPointerException
java.lang.NullPointerException
	at reactor.core.publisher.MonoMetricsFuseableTest.lambda$subscribeToErrorFuseable$7(MonoMetricsFuseableTest.java:364)
	at org.assertj.core.api.SoftAssertions.assertSoftly(SoftAssertions.java:158)
	at reactor.core.publisher.MonoMetricsFuseableTest.subscribeToErrorFuseable(MonoMetricsFuseableTest.java:363)
	at sun.reflect.NativeMethodAccessorImpl.invoke0(Native Method)
	at sun.reflect.NativeMethodAccessorImpl.invoke(NativeMethodAccessorImpl.java:62)
	at sun.reflect.DelegatingMethodAccessorImpl.invoke(DelegatingMethodAccessorImpl.java:43)
(44 more lines...)
Collapse Failed MonoMetricsFuseableTest subscribeToCancelFuseable History
Core < 1 sec
java.lang.NullPointerException: java.lang.NullPointerException
java.lang.NullPointerException
	at reactor.core.publisher.MonoMetricsFuseableTest.lambda$subscribeToCancelFuseable$9(MonoMetricsFuseableTest.java:399)
	at org.assertj.core.api.SoftAssertions.assertSoftly(SoftAssertions.java:158)
	at reactor.core.publisher.MonoMetricsFuseableTest.subscribeToCancelFuseable(MonoMetricsFuseableTest.java:398)
	at sun.reflect.NativeMethodAccessorImpl.invoke0(Native Method)
	at sun.reflect.NativeMethodAccessorImpl.invoke(NativeMethodAccessorImpl.java:62)
	at sun.reflect.DelegatingMethodAccessorImpl.invoke(DelegatingMethodAccessorImpl.java:43)
(44 more lines...)