Build #2,554

Build result summary

Details

Completed
Duration
4 minutes
Labels
None
Agent
bamboo-20.af.pivotal.io
Revision
d1d45c69960df03baa1f5f3848d43abacf1d76ed d1d45c69960df03baa1f5f3848d43abacf1d76ed
Total tests
5075
Failing since
#2552 (Changes by Stephane Maldini <smaldini@pivotal.io>)
Fixed in
#2555 (Changes by Stephane Maldini <smaldini@pivotal.io>)

Responsible

This build has been failing since #2552
No one has taken responsibility

Code commits

Author Commit Message Commit date
Stephane Maldini <smaldini@pivotal.io> Stephane Maldini <smaldini@pivotal.io> d1d45c69960df03baa1f5f3848d43abacf1d76ed d1d45c69960df03baa1f5f3848d43abacf1d76ed Fix Metrics onNext/onComplete and fusion issue Do not consider double onComplete as malformed
Signed-off-by: Stephane Maldini <smaldini@pivotal.io>

Tests

New test failures 1
Status Test View job Duration
Collapse Failed MonoMetricsTest malformedOnComplete History
Core < 1 sec
java.lang.AssertionError: java.lang.AssertionError: 
Expecting actual not to be null
java.lang.AssertionError: 
Expecting actual not to be null
	at reactor.core.publisher.MonoMetricsTest.malformedOnComplete(MonoMetricsTest.java:244)
	at sun.reflect.NativeMethodAccessorImpl.invoke0(Native Method)
	at sun.reflect.NativeMethodAccessorImpl.invoke(NativeMethodAccessorImpl.java:62)
	at sun.reflect.DelegatingMethodAccessorImpl.invoke(DelegatingMethodAccessorImpl.java:43)
(44 more lines...)
Fixed tests 1
Status Test Failing since View job Duration
Successful MonoMetricsTest subscribeToComplete History
Failing since build #2553 (Changes by Stephane Maldini <smaldini@pivotal.io>) Core < 1 sec