Build #2,593

Build: #2593 failed Changes by Simon Basle

Build result summary

Details

Completed
Duration
4 minutes
Labels
None
Agent
bamboo-20.af.pivotal.io
Revision
8d3dfc6e5c2a937045751191c2d1f77452cd2a94 8d3dfc6e5c2a937045751191c2d1f77452cd2a94
Total tests
5121
Failing since
#2592 (Changes by Ugnius <33397860+UgiR@users.noreply.github.com>)
Fixed in
#2594 (Changes by Simon Basle)

Responsible

This build has been failing since #2592
No one has taken responsibility

Code commits

Author Commit Message Commit date
Simon Basle Simon Basle 8d3dfc6e5c2a937045751191c2d1f77452cd2a94 8d3dfc6e5c2a937045751191c2d1f77452cd2a94 fix #1848 StepVerifier API to subscribe to source and verify it later
This commit introduces `StepVerifier#verifyLater()`: a way to defer the
verification of a source while still triggering a subscription to it.

This is especially useful in scenarios where a source will only emit
after having received several subscription, like an `autoConnect(2)`
ConnectableFlux.

Tests

New test failures 2
Status Test View job Duration
Collapse Failed MonoDelayElementTest normalIsDelayed History
Core < 1 sec
reactor.core.Exceptions$ReactorRejectedExecutionException: reactor.core.Exceptions$ReactorRejectedExecutionException: Scheduler unavailable
reactor.core.Exceptions$ReactorRejectedExecutionException: Scheduler unavailable
	at reactor.core.Exceptions.failWithRejected(Exceptions.java:249)
	at reactor.core.publisher.Operators.onRejectedExecution(Operators.java:833)
	at reactor.core.publisher.MonoDelayElement$DelayElementSubscriber.onNext(MonoDelayElement.java:126)
	at reactor.core.publisher.FluxHide$HideSubscriber.onNext(FluxHide.java:74)
	at reactor.core.publisher.FluxPeekFuseable$PeekFuseableSubscriber.onNext(FluxPeekFuseable.java:203)
	at reactor.core.publisher.Operators$ScalarSubscription.request(Operators.java:2138)
(96 more lines...)
Collapse Failed MonoPublishOnTest rejectedExecutionExceptionOnDataSignalExecutorService History
Core < 1 sec
java.lang.AssertionError: java.lang.AssertionError: Error present: reactor.core.Exceptions$ReactorRejectedExecutionException: Scheduler unavailable (ReactorRejectedExecutionException)
java.lang.AssertionError: Error present: reactor.core.Exceptions$ReactorRejectedExecutionException: Scheduler unavailable (ReactorRejectedExecutionException)
	at reactor.test.subscriber.AssertSubscriber.assertNoError(AssertSubscriber.java:479)
	at reactor.core.publisher.MonoPublishOnTest.rejectedExecutionExceptionOnDataSignalExecutorService(MonoPublishOnTest.java:199)
	at sun.reflect.NativeMethodAccessorImpl.invoke0(Native Method)
	at sun.reflect.NativeMethodAccessorImpl.invoke(NativeMethodAccessorImpl.java:62)
	at sun.reflect.DelegatingMethodAccessorImpl.invoke(DelegatingMethodAccessorImpl.java:43)
	at java.lang.reflect.Method.invoke(Method.java:498)
(41 more lines...)
Fixed tests 1
Status Test Failing since View job Duration
Successful FluxFlatMapTest errorModeContinueInternalErrorStopStrategyAsync History
Failing since build #2592 (Changes by Ugnius <33397860+UgiR@users.noreply.github.com>) Core < 1 sec