Build #2,607

Build: #2607 failed Changes by Sergei Egorov

Build result summary

Details

Completed
Duration
5 minutes
Labels
None
Agent
bamboo-20.af.pivotal.io
Revision
60a256950cfa8641a8f553b45f5b15775a9aaf6e 60a256950cfa8641a8f553b45f5b15775a9aaf6e
Total tests
5141
Fixed in
#2608 (Changes by Simon Basle)

Tests

Responsible

Code commits

Author Commit Message Commit date
Sergei Egorov Sergei Egorov 60a256950cfa8641a8f553b45f5b15775a9aaf6e 60a256950cfa8641a8f553b45f5b15775a9aaf6e [chores] Update BlockHound to RC1 (#1877)

Tests

New test failures 1
Status Test View job Duration
Collapse Failed FluxFlatMapTest errorModeContinueInternalErrorStopStrategyAsync History
Core < 1 sec
java.lang.AssertionError: java.lang.AssertionError: Expected exactly 1 dropped errors, 0 found.
java.lang.AssertionError: Expected exactly 1 dropped errors, 0 found.
	at reactor.test.MessageFormatter.assertionError(MessageFormatter.java:115)
	at reactor.test.DefaultStepVerifierBuilder$DefaultStepVerifierAssertions.satisfies(DefaultStepVerifierBuilder.java:1795)
	at reactor.test.DefaultStepVerifierBuilder$DefaultStepVerifierAssertions.hasDroppedErrors(DefaultStepVerifierBuilder.java:1907)
	at reactor.core.publisher.FluxFlatMapTest.errorModeContinueInternalErrorStopStrategyAsync(FluxFlatMapTest.java:1608)
	at sun.reflect.NativeMethodAccessorImpl.invoke0(Native Method)
	at sun.reflect.NativeMethodAccessorImpl.invoke(NativeMethodAccessorImpl.java:62)
(43 more lines...)