Build #2,612

Build: #2612 failed Manual run by Stephane Maldini

Build result summary

Details

Completed
Duration
41 seconds
Labels
None
Agent
bamboo-19.af.pivotal.io
Revision
f97acfae17142a5b6fb202346283882f2ff54e60 f97acfae17142a5b6fb202346283882f2ff54e60
Fixed in
#2613 (Changes by Stephane Maldini <smaldini@pivotal.io>)
No failed tests found, a possible compilation error occurred.

Responsible

No one has taken responsibility for this failure

Error summary for Core

The job generated some errors, drill down into the full build log for more details.

Could not find test result reports in the /opt/bamboo-home/xml-data/build-dir/REACTOR-RNEXT-JOB1 directory.
        at org.gradle.tooling.internal.provider.SessionScopeBuildActionExecuter.execute(SessionScopeBuildActionExecuter.java:68)
        at org.gradle.tooling.internal.provider.SessionScopeBuildActionExecuter.execute(SessionScopeBuildActionExecuter.java:38)
        at org.gradle.tooling.internal.provider.GradleThreadBuildActionExecuter.execute(GradleThreadBuildActionExecuter.java:37)
        at org.gradle.tooling.internal.provider.GradleThreadBuildActionExecuter.execute(GradleThreadBuildActionExecuter.java:26)
        at org.gradle.tooling.internal.provider.ParallelismConfigurationBuildActionExecuter.execute(ParallelismConfigurationBuildActionExecuter.java:43)
        at org.gradle.tooling.internal.provider.ParallelismConfigurationBuildActionExecuter.execute(ParallelismConfigurationBuildActionExecuter.java:29)
        at org.gradle.tooling.internal.provider.StartParamsValidatingActionExecuter.execute(StartParamsValidatingActionExecuter.java:60)
        at org.gradle.tooling.internal.provider.StartParamsValidatingActionExecuter.execute(StartParamsValidatingActionExecuter.java:32)
        at org.gradle.tooling.internal.provider.SessionFailureReportingActionExecuter.execute(SessionFailureReportingActionExecuter.java:55)
        at org.gradle.tooling.internal.provider.SessionFailureReportingActionExecuter.execute(SessionFailureReportingActionExecuter.java:41)
        at org.gradle.tooling.internal.provider.SetupLoggingActionExecuter.execute(SetupLoggingActionExecuter.java:48)
        at org.gradle.tooling.internal.provider.SetupLoggingActionExecuter.execute(SetupLoggingActionExecuter.java:32)
        at org.gradle.launcher.daemon.server.exec.ExecuteBuild.doBuild(ExecuteBuild.java:67)
        at org.gradle.launcher.daemon.server.exec.BuildCommandOnly.execute(BuildCommandOnly.java:36)
        at org.gradle.launcher.daemon.server.api.DaemonCommandExecution.proceed(DaemonCommandExecution.java:104)
        at org.gradle.launcher.daemon.server.exec.WatchForDisconnection.execute(WatchForDisconnection.java:37)
        at org.gradle.launcher.daemon.server.api.DaemonCommandExecution.proceed(DaemonCommandExecution.java:104)
        at org.gradle.launcher.daemon.server.exec.ResetDeprecationLogger.execute(ResetDeprecationLogger.java:26)
        at org.gradle.launcher.daemon.server.api.DaemonCommandExecution.proceed(DaemonCommandExecution.java:104)
        at org.gradle.launcher.daemon.server.exec.RequestStopIfSingleUsedDaemon.execute(RequestStopIfSingleUsedDaemon.java:34)
        at org.gradle.launcher.daemon.server.api.DaemonCommandExecution.proceed(DaemonCommandExecution.java:104)
        at org.gradle.launcher.daemon.server.exec.ForwardClientInput$2.call(ForwardClientInput.java:74)
        at org.gradle.launcher.daemon.server.exec.ForwardClientInput$2.call(ForwardClientInput.java:72)
        at org.gradle.util.Swapper.swap(Swapper.java:38)
        at org.gradle.launcher.daemon.server.exec.ForwardClientInput.execute(ForwardClientInput.java:72)
        at org.gradle.launcher.daemon.server.api.DaemonCommandExecution.proceed(DaemonCommandExecution.java:104)
        at org.gradle.launcher.daemon.server.exec.LogAndCheckHealth.execute(LogAndCheckHealth.java:50)
        at org.gradle.launcher.daemon.server.api.DaemonCommandExecution.proceed(DaemonCommandExecution.java:104)
        at org.gradle.launcher.daemon.server.exec.LogToClient.doBuild(LogToClient.java:62)
        at org.gradle.launcher.daemon.server.exec.BuildCommandOnly.execute(BuildCommandOnly.java:36)
        at org.gradle.launcher.daemon.server.api.DaemonCommandExecution.proceed(DaemonCommandExecution.java:104)
        at org.gradle.launcher.daemon.server.exec.EstablishBuildEnvironment.doBuild(EstablishBuildEnvironment.java:81)
        at org.gradle.launcher.daemon.server.exec.BuildCommandOnly.execute(BuildCommandOnly.java:36)
        at org.gradle.launcher.daemon.server.api.DaemonCommandExecution.proceed(DaemonCommandExecution.java:104)
        at org.gradle.launcher.daemon.server.exec.StartBuildOrRespondWithBusy$1.run(StartBuildOrRespondWithBusy.java:50)
        at org.gradle.launcher.daemon.server.DaemonStateCoordinator$1.run(DaemonStateCoordinator.java:295)
        at org.gradle.internal.concurrent.ExecutorPolicy$CatchAndRecordFailures.onExecute(ExecutorPolicy.java:63)
        at org.gradle.internal.concurrent.ManagedExecutorImpl$1.run(ManagedExecutorImpl.java:46)
        at org.gradle.internal.concurrent.ThreadFactoryImpl$ManagedThreadRunnable.run(ThreadFactoryImpl.java:55)
Caused by: org.gradle.api.internal.artifacts.ivyservice.DefaultLenientConfiguration$ArtifactResolveException: Could not resolve all files for configuration ':benchmarks:compileClasspath'.
        at org.gradle.api.internal.artifacts.configurations.DefaultConfiguration.rethrowFailure(DefaultConfiguration.java:1195)
        at org.gradle.api.internal.artifacts.configurations.DefaultConfiguration.access$2100(DefaultConfiguration.java:138)
        at org.gradle.api.internal.artifacts.configurations.DefaultConfiguration$ConfigurationFileCollection.getFiles(DefaultConfiguration.java:1170)
        at org.gradle.api.internal.file.AbstractFileCollection.iterator(AbstractFileCollection.java:72)
        at org.gradle.api.internal.artifacts.configurations.DefaultConfiguration.iterator(DefaultConfiguration.java:467)
        at kotlin.collections.CollectionsKt__MutableCollectionsKt.addAll(MutableCollections.kt:127)
        at kotlin.collections.CollectionsKt___CollectionsKt.plus(_Collections.kt:2054)
        at org.jetbrains.kotlin.gradle.tasks.AbstractKotlinCompile.getCompileClasspath$kotlin_gradle_plugin(Tasks.kt:164)
        at org.jetbrains.kotlin.gradle.tasks.KotlinCompile.setupCompilerArgs(Tasks.kt:411)
        at org.jetbrains.kotlin.gradle.tasks.KotlinCompile.setupCompilerArgs(Tasks.kt:355)
        at org.jetbrains.kotlin.gradle.internal.CompilerArgumentAware$DefaultImpls.setupCompilerArgs$default(CompilerArgumentAware.kt:37)
        at org.jetbrains.kotlin.gradle.internal.CompilerArgumentAwareKt.prepareCompilerArguments(CompilerArgumentAware.kt:41)
        at org.jetbrains.kotlin.gradle.internal.CompilerArgumentAware$DefaultImpls.getFilteredArgumentsMap(CompilerArgumentAware.kt:34)
        at org.jetbrains.kotlin.gradle.internal.CompilerArgumentAwareWithInput$DefaultImpls.getFilteredArgumentsMap(CompilerArgumentAware.kt:54)
        at org.jetbrains.kotlin.gradle.tasks.AbstractKotlinCompileTool.getFilteredArgumentsMap(Tasks.kt:48)
        at org.jetbrains.kotlin.gradle.tasks.KotlinCompile_Decorated.getFilteredArgumentsMap(Unknown Source)
        at org.gradle.api.internal.tasks.properties.bean.AbstractNestedRuntimeBeanNode$BeanPropertyValue$1$1.create(AbstractNestedRuntimeBeanNode.java:75)
        at org.gradle.util.SingleMessageLogger.whileDisabled(SingleMessageLogger.java:341)
        at org.gradle.api.internal.tasks.properties.bean.AbstractNestedRuntimeBeanNode$BeanPropertyValue$1.get(AbstractNestedRuntimeBeanNode.java:72)
        at com.google.common.base.Suppliers$NonSerializableMemoizingSupplier.get(Suppliers.java:167)
        at org.gradle.api.internal.tasks.properties.bean.AbstractNestedRuntimeBeanNode$BeanPropertyValue.call(AbstractNestedRuntimeBeanNode.java:119)
        at org.gradle.api.internal.tasks.properties.AbstractValidatingProperty.validate(AbstractValidatingProperty.java:37)
        at org.gradle.api.internal.tasks.properties.DefaultTaskProperties.validate(DefaultTaskProperties.java:184)
        at org.gradle.api.internal.tasks.execution.ValidatingTaskExecuter.execute(ValidatingTaskExecuter.java:54)
        at org.gradle.api.internal.tasks.execution.SkipEmptySourceFilesTaskExecuter.execute(SkipEmptySourceFilesTaskExecuter.java:108)
        at org.gradle.api.internal.tasks.execution.ResolveBeforeExecutionOutputsTaskExecuter.execute(ResolveBeforeExecutionOutputsTaskExecuter.java:67)
        at org.gradle.api.internal.tasks.execution.ResolveAfterPreviousExecutionStateTaskExecuter.execute(ResolveAfterPreviousExecutionStateTaskExecuter.java:46)
        at org.gradle.api.internal.tasks.execution.CleanupStaleOutputsExecuter.execute(CleanupStaleOutputsExecuter.java:94)
        at org.gradle.api.internal.tasks.execution.FinalizePropertiesTaskExecuter.execute(FinalizePropertiesTaskExecuter.java:46)
        at org.gradle.api.internal.tasks.execution.ResolveTaskExecutionModeExecuter.execute(ResolveTaskExecutionModeExecuter.java:95)
        at org.gradle.api.internal.tasks.execution.SkipTaskWithNoActionsExecuter.execute(SkipTaskWithNoActionsExecuter.java:57)
        at org.gradle.api.internal.tasks.execution.SkipOnlyIfTaskExecuter.execute(SkipOnlyIfTaskExecuter.java:56)
        at org.gradle.api.internal.tasks.execution.CatchExceptionTaskExecuter.execute(CatchExceptionTaskExecuter.java:36)
        ... 115 more
Caused by: org.gradle.internal.resolve.ModuleVersionNotFoundException: Could not find io.projectreactor.addons:reactor-extra:3.3.0.BUILD-SNAPSHOT.
Searched in the following locations:
  - file:/home/bamboo/.m2/repository/io/projectreactor/addons/reactor-extra/3.3.0.BUILD-SNAPSHOT/maven-metadata.xml
  - file:/home/bamboo/.m2/repository/io/projectreactor/addons/reactor-extra/3.3.0.BUILD-SNAPSHOT/reactor-extra-3.3.0.BUILD-SNAPSHOT.pom
  - file:/home/bamboo/.m2/repository/io/projectreactor/addons/reactor-extra/3.3.0.BUILD-SNAPSHOT/reactor-extra-3.3.0.BUILD-SNAPSHOT.jar
  - https://repo.maven.apache.org/maven2/io/projectreactor/addons/reactor-extra/3.3.0.BUILD-SNAPSHOT/maven-metadata.xml
  - https://repo.maven.apache.org/maven2/io/projectreactor/addons/reactor-extra/3.3.0.BUILD-SNAPSHOT/reactor-extra-3.3.0.BUILD-SNAPSHOT.pom
  - https://repo.maven.apache.org/maven2/io/projectreactor/addons/reactor-extra/3.3.0.BUILD-SNAPSHOT/reactor-extra-3.3.0.BUILD-SNAPSHOT.jar
  - https://jcenter.bintray.com/io/projectreactor/addons/reactor-extra/3.3.0.BUILD-SNAPSHOT/maven-metadata.xml
  - https://jcenter.bintray.com/io/projectreactor/addons/reactor-extra/3.3.0.BUILD-SNAPSHOT/reactor-extra-3.3.0.BUILD-SNAPSHOT.pom
  - https://jcenter.bintray.com/io/projectreactor/addons/reactor-extra/3.3.0.BUILD-SNAPSHOT/reactor-extra-3.3.0.BUILD-SNAPSHOT.jar
  - https://repo.spring.io/libs-milestone/io/projectreactor/addons/reactor-extra/3.3.0.BUILD-SNAPSHOT/maven-metadata.xml
  - https://repo.spring.io/libs-milestone/io/projectreactor/addons/reactor-extra/3.3.0.BUILD-SNAPSHOT/reactor-extra-3.3.0.BUILD-SNAPSHOT.pom
  - https://repo.spring.io/libs-milestone/io/projectreactor/addons/reactor-extra/3.3.0.BUILD-SNAPSHOT/reactor-extra-3.3.0.BUILD-SNAPSHOT.jar
  - https://oss.sonatype.org/content/repositories/releases/io/projectreactor/addons/reactor-extra/3.3.0.BUILD-SNAPSHOT/maven-metadata.xml
  - https://oss.sonatype.org/content/repositories/releases/io/projectreactor/addons/reactor-extra/3.3.0.BUILD-SNAPSHOT/reactor-extra-3.3.0.BUILD-SNAPSHOT.pom
  - https://oss.sonatype.org/content/repositories/releases/io/projectreactor/addons/reactor-extra/3.3.0.BUILD-SNAPSHOT/reactor-extra-3.3.0.BUILD-SNAPSHOT.jar
  - https://repo.spring.io/libs-milestone/io.projectreactor.addons/reactor-extra/ivy-3.3.0.BUILD-SNAPSHOT.xml
  - https://repo.spring.io/libs-milestone/io.projectreactor.addons/reactor-extra/3.3.0.BUILD-SNAPSHOT/reactor-extra-3.3.0.BUILD-SNAPSHOT.jar
Required by:
    project :benchmarks


* Get more help at https://help.gradle.org

BUILD FAILED in 14s