Build #2,641

Build result summary

Details

Completed
Duration
40 seconds
Labels
None
Agent
bamboo-21.af.pivotal.io
Revision
f343f3c11ec92fd234fcb15b5f78cf9531e1ee25 f343f3c11ec92fd234fcb15b5f78cf9531e1ee25
Failing since
#2640 (Changes by Simon Basle)
Fixed in
#2645 (Manual run by Simon Basle)
No failed tests found, a possible compilation error occurred.

Responsible

Code commits

Author Commit Message Commit date
Juan Antonio Breña Moral <bren@juanantonio.info> Juan Antonio Breña Moral <bren@juanantonio.info> f343f3c11ec92fd234fcb15b5f78cf9531e1ee25 f343f3c11ec92fd234fcb15b5f78cf9531e1ee25 Test justOrEmpty(Optional.ofNullable(null)) (#1929)

Error summary for Core

The job generated some errors, drill down into the full build log for more details.

Could not find test result reports in the /opt/bamboo-home/xml-data/build-dir/REACTOR-RNEXT-JOB1 directory.
        at org.gradle.launcher.daemon.server.exec.RequestStopIfSingleUsedDaemon.execute(RequestStopIfSingleUsedDaemon.java:34)
        at org.gradle.launcher.daemon.server.api.DaemonCommandExecution.proceed(DaemonCommandExecution.java:104)
        at org.gradle.launcher.daemon.server.exec.ForwardClientInput$2.call(ForwardClientInput.java:74)
        at org.gradle.launcher.daemon.server.exec.ForwardClientInput$2.call(ForwardClientInput.java:72)
        at org.gradle.util.Swapper.swap(Swapper.java:38)
        at org.gradle.launcher.daemon.server.exec.ForwardClientInput.execute(ForwardClientInput.java:72)
        at org.gradle.launcher.daemon.server.api.DaemonCommandExecution.proceed(DaemonCommandExecution.java:104)
        at org.gradle.launcher.daemon.server.exec.LogAndCheckHealth.execute(LogAndCheckHealth.java:50)
        at org.gradle.launcher.daemon.server.api.DaemonCommandExecution.proceed(DaemonCommandExecution.java:104)
        at org.gradle.launcher.daemon.server.exec.LogToClient.doBuild(LogToClient.java:62)
        at org.gradle.launcher.daemon.server.exec.BuildCommandOnly.execute(BuildCommandOnly.java:36)
        at org.gradle.launcher.daemon.server.api.DaemonCommandExecution.proceed(DaemonCommandExecution.java:104)
        at org.gradle.launcher.daemon.server.exec.EstablishBuildEnvironment.doBuild(EstablishBuildEnvironment.java:81)
        at org.gradle.launcher.daemon.server.exec.BuildCommandOnly.execute(BuildCommandOnly.java:36)
        at org.gradle.launcher.daemon.server.api.DaemonCommandExecution.proceed(DaemonCommandExecution.java:104)
        at org.gradle.launcher.daemon.server.exec.StartBuildOrRespondWithBusy$1.run(StartBuildOrRespondWithBusy.java:50)
        at org.gradle.launcher.daemon.server.DaemonStateCoordinator$1.run(DaemonStateCoordinator.java:295)
        at org.gradle.internal.concurrent.ExecutorPolicy$CatchAndRecordFailures.onExecute(ExecutorPolicy.java:63)
        at org.gradle.internal.concurrent.ManagedExecutorImpl$1.run(ManagedExecutorImpl.java:46)
        at org.gradle.internal.concurrent.ThreadFactoryImpl$ManagedThreadRunnable.run(ThreadFactoryImpl.java:55)
Caused by: org.gradle.api.internal.plugins.PluginApplicationException: Failed to apply plugin [id 'io.reactor.gradle.custom-version']
        at org.gradle.api.internal.plugins.DefaultPluginManager.doApply(DefaultPluginManager.java:163)
        at org.gradle.api.internal.plugins.DefaultPluginManager.apply(DefaultPluginManager.java:133)
        at org.gradle.api.internal.plugins.DefaultObjectConfigurationAction.applyType(DefaultObjectConfigurationAction.java:120)
        at org.gradle.api.internal.plugins.DefaultObjectConfigurationAction.access$200(DefaultObjectConfigurationAction.java:38)
        at org.gradle.api.internal.plugins.DefaultObjectConfigurationAction$3.run(DefaultObjectConfigurationAction.java:86)
        at org.gradle.api.internal.plugins.DefaultObjectConfigurationAction.execute(DefaultObjectConfigurationAction.java:143)
        at org.gradle.api.internal.project.AbstractPluginAware.apply(AbstractPluginAware.java:46)
        at org.gradle.internal.metaobject.BeanDynamicObject$MetaClassAdapter.invokeMethod(BeanDynamicObject.java:479)
        at org.gradle.internal.metaobject.BeanDynamicObject.tryInvokeMethod(BeanDynamicObject.java:191)
        at org.gradle.internal.metaobject.CompositeDynamicObject.tryInvokeMethod(CompositeDynamicObject.java:98)
        at org.gradle.internal.extensibility.MixInClosurePropertiesAsMethodsDynamicObject.tryInvokeMethod(MixInClosurePropertiesAsMethodsDynamicObject.java:33)
        at org.gradle.internal.metaobject.ConfigureDelegate.invokeMethod(ConfigureDelegate.java:56)
        at build_2mfqsl7kgex3d0m48vbob3vjz$_run_closure4.doCall(/opt/bamboo-home/xml-data/build-dir/REACTOR-RNEXT-JOB1/build.gradle:197)
        at org.gradle.util.ClosureBackedAction.execute(ClosureBackedAction.java:70)
        at org.gradle.util.ConfigureUtil.configureTarget(ConfigureUtil.java:154)
        at org.gradle.util.ConfigureUtil.configure(ConfigureUtil.java:105)
        at org.gradle.util.ConfigureUtil$WrappedConfigureAction.execute(ConfigureUtil.java:166)
        at org.gradle.api.internal.DefaultMutationGuard$2.execute(DefaultMutationGuard.java:41)
        at org.gradle.internal.Actions.with(Actions.java:246)
        at org.gradle.api.internal.project.BuildOperationCrossProjectConfigurator$2$1.run(BuildOperationCrossProjectConfigurator.java:79)
        at org.gradle.internal.operations.DefaultBuildOperationExecutor$RunnableBuildOperationWorker.execute(DefaultBuildOperationExecutor.java:402)
        at org.gradle.internal.operations.DefaultBuildOperationExecutor$RunnableBuildOperationWorker.execute(DefaultBuildOperationExecutor.java:394)
        at org.gradle.internal.operations.DefaultBuildOperationExecutor$1.execute(DefaultBuildOperationExecutor.java:165)
        at org.gradle.internal.operations.DefaultBuildOperationExecutor.execute(DefaultBuildOperationExecutor.java:250)
        at org.gradle.internal.operations.DefaultBuildOperationExecutor.execute(DefaultBuildOperationExecutor.java:158)
        at org.gradle.internal.operations.DefaultBuildOperationExecutor.run(DefaultBuildOperationExecutor.java:92)
        at org.gradle.internal.operations.DelegatingBuildOperationExecutor.run(DelegatingBuildOperationExecutor.java:31)
        at org.gradle.api.internal.project.BuildOperationCrossProjectConfigurator$2.run(BuildOperationCrossProjectConfigurator.java:76)
        at org.gradle.internal.Factories$1.create(Factories.java:25)
        at org.gradle.api.internal.project.DefaultProjectStateRegistry$ProjectStateImpl.withMutableState(DefaultProjectStateRegistry.java:200)
        at org.gradle.api.internal.project.DefaultProjectStateRegistry$ProjectStateImpl.withMutableState(DefaultProjectStateRegistry.java:186)
        at org.gradle.api.internal.project.BuildOperationCrossProjectConfigurator.runProjectConfigureAction(BuildOperationCrossProjectConfigurator.java:73)
        at org.gradle.api.internal.project.BuildOperationCrossProjectConfigurator.access$400(BuildOperationCrossProjectConfigurator.java:32)
        at org.gradle.api.internal.project.BuildOperationCrossProjectConfigurator$1.doRunProjectConfigure(BuildOperationCrossProjectConfigurator.java:67)
        at org.gradle.api.internal.project.BuildOperationCrossProjectConfigurator$BlockConfigureBuildOperation.run(BuildOperationCrossProjectConfigurator.java:121)
        at org.gradle.internal.operations.DefaultBuildOperationExecutor$RunnableBuildOperationWorker.execute(DefaultBuildOperationExecutor.java:402)
        at org.gradle.internal.operations.DefaultBuildOperationExecutor$RunnableBuildOperationWorker.execute(DefaultBuildOperationExecutor.java:394)
        at org.gradle.internal.operations.DefaultBuildOperationExecutor$1.execute(DefaultBuildOperationExecutor.java:165)
        at org.gradle.internal.operations.DefaultBuildOperationExecutor.execute(DefaultBuildOperationExecutor.java:250)
        at org.gradle.internal.operations.DefaultBuildOperationExecutor.execute(DefaultBuildOperationExecutor.java:158)
        at org.gradle.internal.operations.DefaultBuildOperationExecutor.run(DefaultBuildOperationExecutor.java:92)
        at org.gradle.internal.operations.DelegatingBuildOperationExecutor.run(DelegatingBuildOperationExecutor.java:31)
        at org.gradle.api.internal.project.BuildOperationCrossProjectConfigurator.runBlockConfigureAction(BuildOperationCrossProjectConfigurator.java:64)
        at org.gradle.api.internal.project.BuildOperationCrossProjectConfigurator.allprojects(BuildOperationCrossProjectConfigurator.java:54)
        at org.gradle.api.internal.project.DefaultProject.allprojects(DefaultProject.java:661)
        at org.gradle.invocation.DefaultGradle$2.execute(DefaultGradle.java:252)
        at org.gradle.invocation.DefaultGradle$2.execute(DefaultGradle.java:250)
        at org.gradle.invocation.DefaultGradle.rootProject(DefaultGradle.java:241)
        at org.gradle.invocation.DefaultGradle.allprojects(DefaultGradle.java:250)
        at org.gradle.invocation.DefaultGradle_Decorated.allprojects(Unknown Source)
        at org.gradle.invocation.DefaultGradle_Decorated$allprojects.call(Unknown Source)
        at build_2mfqsl7kgex3d0m48vbob3vjz.run(/opt/bamboo-home/xml-data/build-dir/REACTOR-RNEXT-JOB1/build.gradle:196)
        at org.gradle.groovy.scripts.internal.DefaultScriptRunnerFactory$ScriptRunnerImpl.run(DefaultScriptRunnerFactory.java:90)
        ... 127 more
Caused by: org.gradle.api.InvalidUserDataException: Custom version for project passed through -PversionBranch must be alphanumeric chars only: ""
        at io.reactor.gradle.CustomVersionPlugin.apply(CustomVersionPlugin.java:54)
        at io.reactor.gradle.CustomVersionPlugin.apply(CustomVersionPlugin.java:35)
        at org.gradle.api.internal.plugins.ImperativeOnlyPluginTarget.applyImperative(ImperativeOnlyPluginTarget.java:42)
        at org.gradle.api.internal.plugins.RuleBasedPluginTarget.applyImperative(RuleBasedPluginTarget.java:50)
        at org.gradle.api.internal.plugins.DefaultPluginManager.addPlugin(DefaultPluginManager.java:177)
        at org.gradle.api.internal.plugins.DefaultPluginManager.access$300(DefaultPluginManager.java:51)
        at org.gradle.api.internal.plugins.DefaultPluginManager$AddPluginBuildOperation.run(DefaultPluginManager.java:267)
        at org.gradle.internal.operations.DefaultBuildOperationExecutor$RunnableBuildOperationWorker.execute(DefaultBuildOperationExecutor.java:402)
        at org.gradle.internal.operations.DefaultBuildOperationExecutor$RunnableBuildOperationWorker.execute(DefaultBuildOperationExecutor.java:394)
        at org.gradle.internal.operations.DefaultBuildOperationExecutor$1.execute(DefaultBuildOperationExecutor.java:165)
        at org.gradle.internal.operations.DefaultBuildOperationExecutor.execute(DefaultBuildOperationExecutor.java:250)
        at org.gradle.internal.operations.DefaultBuildOperationExecutor.execute(DefaultBuildOperationExecutor.java:158)
        at org.gradle.internal.operations.DefaultBuildOperationExecutor.run(DefaultBuildOperationExecutor.java:92)
        at org.gradle.internal.operations.DelegatingBuildOperationExecutor.run(DelegatingBuildOperationExecutor.java:31)
        at org.gradle.api.internal.plugins.DefaultPluginManager$2.execute(DefaultPluginManager.java:155)
        at org.gradle.api.internal.plugins.DefaultPluginManager$2.execute(DefaultPluginManager.java:152)
        at org.gradle.configuration.internal.DefaultUserCodeApplicationContext.apply(DefaultUserCodeApplicationContext.java:48)
        at org.gradle.api.internal.plugins.DefaultPluginManager.doApply(DefaultPluginManager.java:152)
        ... 179 more


* Get more help at https://help.gradle.org

BUILD FAILED in 32s