Build #2,659

Build: #2659 failed Changes by wonwoo <fidel.lee@dailyhotel.com>

Build result summary

Details

Completed
Duration
12 minutes
Labels
None
Agent
bamboo-22.af.pivotal.io
Revision
671a90dcb6fc5b10998fc745cc5034907c5c0413 671a90dcb6fc5b10998fc745cc5034907c5c0413
Total tests
5222
Fixed in
#2660 (Changes by slisaasquatch <slisaasquatch@users.noreply.github.com>)

Tests

Responsible

No one has taken responsibility for this failure

Code commits

Author Commit Message Commit date
wonwoo <fidel.lee@dailyhotel.com> wonwoo <fidel.lee@dailyhotel.com> 671a90dcb6fc5b10998fc745cc5034907c5c0413 671a90dcb6fc5b10998fc745cc5034907c5c0413 [polish] Small whitespace cleanup (#1947)

Tests

New test failures 1
Status Test View job Duration
Collapse Failed MonoUsingTest smokeTestMapReduceGuardedByCleanup_normalNotEager History
Core < 1 sec
org.awaitility.core.ConditionTimeoutException: org.awaitility.core.ConditionTimeoutException: Assertion condition defined as a lambda expression in reactor.core.publisher.MonoUsingTest that uses org.assertj.core.api.AtomicBooleanAssert null within 100 milliseconds.
org.awaitility.core.ConditionTimeoutException: Assertion condition defined as a lambda expression in reactor.core.publisher.MonoUsingTest that uses org.assertj.core.api.AtomicBooleanAssert null within 100 milliseconds.
	at org.awaitility.core.ConditionAwaiter.await(ConditionAwaiter.java:145)
	at org.awaitility.core.AssertionCondition.await(AssertionCondition.java:122)
	at org.awaitility.core.AssertionCondition.await(AssertionCondition.java:32)
	at org.awaitility.core.ConditionFactory.until(ConditionFactory.java:902)
	at org.awaitility.core.ConditionFactory.untilAsserted(ConditionFactory.java:723)
	at reactor.core.publisher.MonoUsingTest.smokeTestMapReduceGuardedByCleanup_normalNotEager(MonoUsingTest.java:369)
(49 more lines...)