Build #2,678

Build: #2678 failed Changes by echooymxq <echooy.mxq@gmail.com>

Build result summary

Details

Completed
Duration
6 minutes
Labels
None
Agent
bamboo-24.af.pivotal.io
Revision
7f67c187efd6aa975e6f559d0c0c2a9b9f68e1ec 7f67c187efd6aa975e6f559d0c0c2a9b9f68e1ec
Total tests
5285
Fixed in
#2679 (Manual run by Simon Basle)

Tests

Responsible

No one has taken responsibility for this failure

Code commits

Author Commit Message Commit date
echooymxq <echooy.mxq@gmail.com> echooymxq <echooy.mxq@gmail.com> 7f67c187efd6aa975e6f559d0c0c2a9b9f68e1ec 7f67c187efd6aa975e6f559d0c0c2a9b9f68e1ec [doc] Fix Gradle typo in getting started section (#2001)

Tests

New test failures 1
Status Test View job Duration
Collapse Failed FluxRefCountGraceTest raceSubscribeAndCancelNoTimeout History
Core 14 secs
java.lang.AssertionError: java.lang.AssertionError: The wait timed out!
java.lang.AssertionError: The wait timed out!
	at reactor.test.util.RaceTestUtils.race(RaceTestUtils.java:157)
	at reactor.test.util.RaceTestUtils.race(RaceTestUtils.java:109)
	at reactor.core.publisher.FluxRefCountGraceTest.raceSubscribeAndCancelNoTimeout(FluxRefCountGraceTest.java:163)
	at sun.reflect.NativeMethodAccessorImpl.invoke0(Native Method)
	at sun.reflect.NativeMethodAccessorImpl.invoke(NativeMethodAccessorImpl.java:62)
	at sun.reflect.DelegatingMethodAccessorImpl.invoke(DelegatingMethodAccessorImpl.java:43)
(42 more lines...)