Build #2,686

Build: #2686 failed Changes by Simon Basle

Build result summary

Details

Completed
Duration
5 minutes
Labels
None
Agent
bamboo-24.af.pivotal.io
Revision
0953bcfa608aac9daee1efdb3d58c37804dde054 0953bcfa608aac9daee1efdb3d58c37804dde054
Total tests
5288
Fixed in
#2687 (Changes by Miel Donkers <miel.donkers@instana.com>)

Tests

Responsible

Code commits

Author Commit Message Commit date
Simon Basle Simon Basle 0953bcfa608aac9daee1efdb3d58c37804dde054 0953bcfa608aac9daee1efdb3d58c37804dde054 [build] Let artifactory credentials be passed by env var
The fact that the default properties are dot-separated prevents us to
set them via an environment variable, which is the best option for the
releaser when running in CI.

We thus declare an explicit credentials block using alternate properties
like artifactory_publish_xxx, that can be set via an environment var
of the form ORG_GRADLE_PROJECT_artifactory_publish_xxx.

Additionally, we ensure:
 - publish tasks are skipped if no such properties are set
 - we don't publish env variables to the build, to avoid leaking secrets
 - we give the build info a meaningful name and id

Tests

New test failures 1
Status Test View job Duration
Collapse Failed FluxFlatMapTest errorModeContinueInternalErrorStopStrategyAsync History
Core < 1 sec
java.lang.AssertionError: java.lang.AssertionError: Expected exactly 1 dropped errors, 0 found.
java.lang.AssertionError: Expected exactly 1 dropped errors, 0 found.
	at reactor.test.MessageFormatter.assertionError(MessageFormatter.java:115)
	at reactor.test.DefaultStepVerifierBuilder$DefaultStepVerifierAssertions.satisfies(DefaultStepVerifierBuilder.java:1824)
	at reactor.test.DefaultStepVerifierBuilder$DefaultStepVerifierAssertions.hasDroppedErrors(DefaultStepVerifierBuilder.java:1936)
	at reactor.core.publisher.FluxFlatMapTest.errorModeContinueInternalErrorStopStrategyAsync(FluxFlatMapTest.java:1608)
	at sun.reflect.NativeMethodAccessorImpl.invoke0(Native Method)
	at sun.reflect.NativeMethodAccessorImpl.invoke(NativeMethodAccessorImpl.java:62)
(43 more lines...)