Build #2,708

Build: #2708 failed Changes by Simon Basle

Build result summary

Details

Completed
Duration
5 minutes
Labels
None
Agent
bamboo-22.af.pivotal.io
Revision
29218c1c317545d9fee4fc011cf674d3aade3482 29218c1c317545d9fee4fc011cf674d3aade3482
Total tests
5322
Fixed in
#2709 (Manual run by Simon Basle)

Tests

Responsible

Code commits

Author Commit Message Commit date
Simon Basle Simon Basle 29218c1c317545d9fee4fc011cf674d3aade3482 29218c1c317545d9fee4fc011cf674d3aade3482 Merge #2037 into 3.3
Simon Basle Simon Basle 20113d5a16aa9241848ca5f998c798f4be620cb7 m 20113d5a16aa9241848ca5f998c798f4be620cb7 fix #2037 Unconditionally dispose worker in MonoSubscribeOn#cancel

Tests

New test failures 1
Status Test View job Duration
Collapse Failed FluxFlatMapTest errorModeContinueInternalErrorStopStrategyAsync History
Core < 1 sec
java.lang.AssertionError: java.lang.AssertionError: Expected exactly 1 dropped errors, 0 found.
java.lang.AssertionError: Expected exactly 1 dropped errors, 0 found.
	at reactor.test.MessageFormatter.assertionError(MessageFormatter.java:115)
	at reactor.test.DefaultStepVerifierBuilder$DefaultStepVerifierAssertions.satisfies(DefaultStepVerifierBuilder.java:1824)
	at reactor.test.DefaultStepVerifierBuilder$DefaultStepVerifierAssertions.hasDroppedErrors(DefaultStepVerifierBuilder.java:1936)
	at reactor.core.publisher.FluxFlatMapTest.errorModeContinueInternalErrorStopStrategyAsync(FluxFlatMapTest.java:1609)
	at sun.reflect.NativeMethodAccessorImpl.invoke0(Native Method)
	at sun.reflect.NativeMethodAccessorImpl.invoke(NativeMethodAccessorImpl.java:62)
(43 more lines...)