Build #2,708

Build: #2708 failed Changes by Simon Basle

Test results

  • 5,322 tests in total
  • 1 test failed
  • 1 failure is new
  • 16 tests were quarantined / skipped
  • 4 minutes taken in total.
New test failures 1
Status Test View job Duration
Collapse Failed FluxFlatMapTest errorModeContinueInternalErrorStopStrategyAsync History
Core < 1 sec
java.lang.AssertionError: java.lang.AssertionError: Expected exactly 1 dropped errors, 0 found.
java.lang.AssertionError: Expected exactly 1 dropped errors, 0 found.
	at reactor.test.MessageFormatter.assertionError(MessageFormatter.java:115)
	at reactor.test.DefaultStepVerifierBuilder$DefaultStepVerifierAssertions.satisfies(DefaultStepVerifierBuilder.java:1824)
	at reactor.test.DefaultStepVerifierBuilder$DefaultStepVerifierAssertions.hasDroppedErrors(DefaultStepVerifierBuilder.java:1936)
	at reactor.core.publisher.FluxFlatMapTest.errorModeContinueInternalErrorStopStrategyAsync(FluxFlatMapTest.java:1609)
	at sun.reflect.NativeMethodAccessorImpl.invoke0(Native Method)
	at sun.reflect.NativeMethodAccessorImpl.invoke(NativeMethodAccessorImpl.java:62)
(43 more lines...)
Skipped tests 16
Status Test Failing since View job
Skipped EmitterProcessorTest testPerformance History
Core
Skipped EmitterProcessorTest test History
Core
Skipped EmitterProcessorTest testRacing History
Core
Skipped FluxDelaySequenceTest delayElements History
Core
Skipped FluxFlatMapTest progressiveRequest History
Core
Skipped FluxGroupByTest twoGroupsFullAsync History
Core
Skipped FluxGroupByTest twoGroupsFullAsyncFullHide History
Core
Skipped FluxPublishOnTest rejectedExecutionExceptionOnDataSignalExecutorService History
Core
Skipped FluxPublishOnTest rejectedExecutionExceptionOnErrorSignalExecutor History
Core
Skipped LiftFunctionTest liftGroupedFlux History
Core
Skipped MonoDoOnEachTest triggersCompleteSignalInMonoOnNextConditional History
Core
Skipped MonoDoOnEachTest triggersCompleteSignalInMonoOnNextConditionalFused History
Core
Skipped MonoPublishOnTest rejectedExecutionSubscribeExecutorServiceScheduler History
Core
Skipped MonoPublishOnTest rejectedExecutionSubscribeExecutorScheduler History
Core
Skipped FluxTests splitBugEventuallyHappens History
Core
Skipped FluxTests endLessTimer History
Core