Build #2,715

Build: #2715 failed Changes by Simon Basle

Test results

  • 5,345 tests in total
  • 1 test failed
  • 1 failure is new
  • 16 tests were quarantined / skipped
  • 4 minutes taken in total.
New test failures 1
Status Test View job Duration
Collapse Failed SchedulersTest immediateTaskIsSkippedIfDisposeRightAfter History
Core 1 sec
java.lang.AssertionError: java.lang.AssertionError: Task not skipped
java.lang.AssertionError: Task not skipped
	at org.junit.Assert.fail(Assert.java:88)
	at org.junit.Assert.assertTrue(Assert.java:41)
	at reactor.core.scheduler.SchedulersTest.immediateTaskIsSkippedIfDisposeRightAfter(SchedulersTest.java:753)
	at sun.reflect.NativeMethodAccessorImpl.invoke0(Native Method)
	at sun.reflect.NativeMethodAccessorImpl.invoke(NativeMethodAccessorImpl.java:62)
	at sun.reflect.DelegatingMethodAccessorImpl.invoke(DelegatingMethodAccessorImpl.java:43)
(45 more lines...)
Skipped tests 16
Status Test Failing since View job
Skipped EmitterProcessorTest testPerformance History
Core
Skipped EmitterProcessorTest test History
Core
Skipped EmitterProcessorTest testRacing History
Core
Skipped FluxDelaySequenceTest delayElements History
Core
Skipped FluxFlatMapTest progressiveRequest History
Core
Skipped FluxGroupByTest twoGroupsFullAsyncFullHide History
Core
Skipped FluxGroupByTest twoGroupsFullAsync History
Core
Skipped FluxPublishOnTest rejectedExecutionExceptionOnErrorSignalExecutor History
Core
Skipped FluxPublishOnTest rejectedExecutionExceptionOnDataSignalExecutorService History
Core
Skipped LiftFunctionTest liftGroupedFlux History
Core
Skipped MonoDoOnEachTest triggersCompleteSignalInMonoOnNextConditionalFused History
Core
Skipped MonoDoOnEachTest triggersCompleteSignalInMonoOnNextConditional History
Core
Skipped MonoPublishOnTest rejectedExecutionSubscribeExecutorServiceScheduler History
Core
Skipped MonoPublishOnTest rejectedExecutionSubscribeExecutorScheduler History
Core
Skipped FluxTests endLessTimer History
Core
Skipped FluxTests splitBugEventuallyHappens History
Core