Build #2,726

Build: #2726 failed Changes by Simon Basle

Build result summary

Details

Completed
Duration
6 minutes
Labels
None
Agent
bamboo-12.af.pivotal.io
Revision
61b5c02a9242b7d8214c1b0bf9df1d8ad1b37a75 61b5c02a9242b7d8214c1b0bf9df1d8ad1b37a75
Total tests
5361
Fixed in
#2730 (Changes by Simon Basle)

Tests

Responsible

Code commits

Author Commit Message Commit date
Simon Basle Simon Basle 61b5c02a9242b7d8214c1b0bf9df1d8ad1b37a75 61b5c02a9242b7d8214c1b0bf9df1d8ad1b37a75 fix #2060 Introduce and use VirtualTimeScheduler#getOrSet(boolean)
A change in #2017 introduced a regression that prevented externally
initialized VirtualTimeSchedulers to be used in StepVerifier.
This commit allows the StepVerifier to once again discover an already
set VTS instance and use it, taking the `defer` parameter into account.

Tests

New test failures 1
Status Test View job Duration
Collapse Failed FluxFlatMapTest errorModeContinueInternalErrorStopStrategyAsync History
Core 1 sec
org.awaitility.core.ConditionTimeoutException: org.awaitility.core.ConditionTimeoutException: Assertion condition defined as a lambda expression in reactor.core.publisher.FluxFlatMapTest that uses reactor.test.StepVerifier$Assertions Expected exactly 1 dropped errors, 0 found within 1 seconds.
org.awaitility.core.ConditionTimeoutException: Assertion condition defined as a lambda expression in reactor.core.publisher.FluxFlatMapTest that uses reactor.test.StepVerifier$Assertions Expected exactly 1 dropped errors, 0 found within 1 seconds.
	at org.awaitility.core.ConditionAwaiter.await(ConditionAwaiter.java:145)
	at org.awaitility.core.AssertionCondition.await(AssertionCondition.java:122)
	at org.awaitility.core.AssertionCondition.await(AssertionCondition.java:32)
	at org.awaitility.core.ConditionFactory.until(ConditionFactory.java:902)
	at org.awaitility.core.ConditionFactory.untilAsserted(ConditionFactory.java:723)
	at reactor.core.publisher.FluxFlatMapTest.errorModeContinueInternalErrorStopStrategyAsync(FluxFlatMapTest.java:1614)
(57 more lines...)