Build #2,727

Build: #2727 failed Manual run by Simon Basle

Build result summary

Details

Completed
Duration
6 minutes
Labels
None
Agent
bamboo-18.af.pivotal.io
Revision
61b5c02a9242b7d8214c1b0bf9df1d8ad1b37a75 61b5c02a9242b7d8214c1b0bf9df1d8ad1b37a75
Total tests
5361
Failing since
#2726 (Changes by Simon Basle)
Fixed in
#2730 (Changes by Simon Basle)

Responsible

Tests

New test failures 1
Status Test View job Duration
Collapse Failed FluxSwitchOnFirstTest onErrorAndRequestRacingTest History
Core < 1 sec
java.lang.AssertionError: java.lang.AssertionError: No error
java.lang.AssertionError: No error
	at reactor.test.subscriber.AssertSubscriber.assertErrorWith(AssertSubscriber.java:415)
	at reactor.core.publisher.FluxSwitchOnFirstTest.onErrorAndRequestRacingTest(FluxSwitchOnFirstTest.java:1538)
	at sun.reflect.NativeMethodAccessorImpl.invoke0(Native Method)
	at sun.reflect.NativeMethodAccessorImpl.invoke(NativeMethodAccessorImpl.java:62)
	at sun.reflect.DelegatingMethodAccessorImpl.invoke(DelegatingMethodAccessorImpl.java:43)
	at java.lang.reflect.Method.invoke(Method.java:498)
(41 more lines...)
Fixed tests 1
Status Test Failing since View job Duration
Successful FluxFlatMapTest errorModeContinueInternalErrorStopStrategyAsync History
Failing since build #2726 (Changes by Simon Basle) Core < 1 sec