Build #2,728

Build: #2728 failed Manual run by Simon Basle

Build result summary

Details

Completed
Duration
6 minutes
Labels
None
Agent
bamboo-14.af.pivotal.io
Revision
61b5c02a9242b7d8214c1b0bf9df1d8ad1b37a75 61b5c02a9242b7d8214c1b0bf9df1d8ad1b37a75
Total tests
5361
Failing since
#2726 (Changes by Simon Basle)
Fixed in
#2730 (Changes by Simon Basle)

Responsible

Tests

New test failures 1
Status Test View job Duration
Collapse Failed BoundedElasticSchedulerTest lifoEvictionNoThreadRegrowth History
Core 2 secs
java.lang.AssertionError: java.lang.AssertionError: [at most one worker + evictor at end] 
Expecting:
 <0>
to be between:
 [1, 2]
java.lang.AssertionError: [at most one worker + evictor at end] 
Expecting:
 <0>
(53 more lines...)
Fixed tests 1
Status Test Failing since View job Duration
Successful FluxSwitchOnFirstTest onErrorAndRequestRacingTest History
Failing since build #2727 (Manual run by Simon Basle) Core < 1 sec