Build #2,738

Build: #2738 failed Changes by Simon Basle

Build result summary

Details

Completed
Duration
6 minutes
Labels
None
Agent
bamboo-24.af.pivotal.io
Revision
71b92e159b000a0ef8b114ec950f96f30d4d294c 71b92e159b000a0ef8b114ec950f96f30d4d294c
Total tests
5417
Fixed in
#2739 (Manual run by Simon Basle)

Tests

Responsible

Code commits

Author Commit Message Commit date
Simon Basle Simon Basle 71b92e159b000a0ef8b114ec950f96f30d4d294c 71b92e159b000a0ef8b114ec950f96f30d4d294c Prepare release 3.3.4.RELEASE (+merge ignore 3.2.16)
Spring Buildmaster Spring Buildmaster 16e101be0719e875e0c35cece43d7c245481a301 m 16e101be0719e875e0c35cece43d7c245481a301 [artifactory-release] Next development version 3.2.17.BUILD-SNAPSHOT
Spring Buildmaster Spring Buildmaster f15fe6da037fd782c56bc99ddbd986b0859c3ecd m f15fe6da037fd782c56bc99ddbd986b0859c3ecd [artifactory-release] Release version 3.2.16.RELEASE
Simon Basle Simon Basle fc9332ee2a2c2c4caf5d1c90ad6e91933c8a0c79 m fc9332ee2a2c2c4caf5d1c90ad6e91933c8a0c79 Prepare release 3.2.16.RELEASE

Tests

New test failures 1
Status Test View job Duration
Collapse Failed FluxFlatMapTest errorModeContinueInternalErrorStopStrategyAsync History
Core 1 sec
org.awaitility.core.ConditionTimeoutException: org.awaitility.core.ConditionTimeoutException: Assertion condition defined as a lambda expression in reactor.core.publisher.FluxFlatMapTest that uses reactor.test.StepVerifier$Assertions Expected exactly 1 dropped errors, 0 found within 1 seconds.
org.awaitility.core.ConditionTimeoutException: Assertion condition defined as a lambda expression in reactor.core.publisher.FluxFlatMapTest that uses reactor.test.StepVerifier$Assertions Expected exactly 1 dropped errors, 0 found within 1 seconds.
	at org.awaitility.core.ConditionAwaiter.await(ConditionAwaiter.java:145)
	at org.awaitility.core.AssertionCondition.await(AssertionCondition.java:122)
	at org.awaitility.core.AssertionCondition.await(AssertionCondition.java:32)
	at org.awaitility.core.ConditionFactory.until(ConditionFactory.java:902)
	at org.awaitility.core.ConditionFactory.untilAsserted(ConditionFactory.java:723)
	at reactor.core.publisher.FluxFlatMapTest.errorModeContinueInternalErrorStopStrategyAsync(FluxFlatMapTest.java:1614)
(57 more lines...)