Build #2,832

Build: #2832 failed Changes by Simon Baslé <sbasle@vmware.com>

Build result summary

Details

Completed
Duration
8 minutes
Labels
None
Agent
bamboo-19.af.pivotal.io
Revision
079e87dcecf72cb4a4ab84f808da0363d3b13f8c 079e87dcecf72cb4a4ab84f808da0363d3b13f8c
Total tests
7168
Fixed in
#2833 (Manual run by Simon Basle)

Tests

Responsible

No one has taken responsibility for this failure

Code commits

Author Commit Message Commit date
Simon Baslé <sbasle@vmware.com> Simon Baslé <sbasle@vmware.com> 079e87dcecf72cb4a4ab84f808da0363d3b13f8c 079e87dcecf72cb4a4ab84f808da0363d3b13f8c Merge #2262 into 3.4.0-M2
Simon Baslé <sbasle@vmware.com> Simon Baslé <sbasle@vmware.com> 75bca5766871e5987ffd8a1f5992c93b48aac192 m 75bca5766871e5987ffd8a1f5992c93b48aac192 Merge #2262 into 3.3.8.RELEASE
Simon Basle Simon Basle 8983503e3466230cac48734f85aafbf1507e9fff m 8983503e3466230cac48734f85aafbf1507e9fff fix #2262 Make the fact that optional are not in pom anymore explicit
The `withXml` block had become no-op, because OptionalDependenciesPlugin
doesn't generate `<dependency>` blocks for these.

It is replaced with a comment that makes it clearer that these optional
dependencies are not included in the pom anymore, on purpose.

Tests

New test failures 1
Status Test View job Duration
Collapse Failed SchedulersTest immediateTaskIsSkippedIfDisposeRightAfter History
Core 1 sec
java.lang.AssertionError: java.lang.AssertionError: Task not skipped
java.lang.AssertionError: Task not skipped
	at org.junit.Assert.fail(Assert.java:89)
	at org.junit.Assert.assertTrue(Assert.java:42)
	at reactor.core.scheduler.SchedulersTest.immediateTaskIsSkippedIfDisposeRightAfter(SchedulersTest.java:760)
	at sun.reflect.NativeMethodAccessorImpl.invoke0(Native Method)
	at sun.reflect.NativeMethodAccessorImpl.invoke(NativeMethodAccessorImpl.java:62)
	at sun.reflect.DelegatingMethodAccessorImpl.invoke(DelegatingMethodAccessorImpl.java:43)
(67 more lines...)