Build #2,895

Build: #2895 failed Changes by Simon Baslé <sbasle@vmware.com>

Build result summary

Details

Completed
Duration
8 minutes
Labels
None
Agent
bamboo-16.af.pivotal.io
Revision
f6c8afe6c389642e0ed4349a713e5717bf0e3874 f6c8afe6c389642e0ed4349a713e5717bf0e3874
Total tests
7169
Fixed in
#2896 (Changes by Simon Baslé <sbasle@vmware.com>)

Tests

Responsible

No one has taken responsibility for this failure

Code commits

Author Commit Message Commit date
Simon Baslé <sbasle@vmware.com> Simon Baslé <sbasle@vmware.com> f6c8afe6c389642e0ed4349a713e5717bf0e3874 f6c8afe6c389642e0ed4349a713e5717bf0e3874 fix #2338 Add new Emission FAIL_ZERO_SUBSCRIBER error code
Reviewed-in: #2357

Tests

New test failures 1
Status Test View job Duration
Collapse Failed ElasticSchedulerTest eviction History
Core < 1 sec
java.lang.AssertionError: java.lang.AssertionError: 
Expecting empty but was:<[reactor.core.scheduler.ElasticScheduler$CachedService@74efa902]>
java.lang.AssertionError: 
Expecting empty but was:<[reactor.core.scheduler.ElasticScheduler$CachedService@74efa902]>
	at reactor.core.scheduler.ElasticSchedulerTest.eviction(ElasticSchedulerTest.java:102)
	at sun.reflect.NativeMethodAccessorImpl.invoke0(Native Method)
	at sun.reflect.NativeMethodAccessorImpl.invoke(NativeMethodAccessorImpl.java:62)
	at sun.reflect.DelegatingMethodAccessorImpl.invoke(DelegatingMethodAccessorImpl.java:43)
(9 more lines...)