Build #2,979

Build: #2979 failed Changes by Simon Baslé <sbasle@vmware.com>

Build result summary

Details

Completed
Duration
9 minutes
Labels
None
Agent
bamboo-16.af.pivotal.io
Revision
666c8c9a1677ffee75412396a5d66bcac2f02753 666c8c9a1677ffee75412396a5d66bcac2f02753
Total tests
7289
Fixed in
#2980 (Changes by Simon Baslé <sbasle@vmware.com>)
No failed test found. A possible compilation error occurred.

Tests

Responsible

No one has taken responsibility for this failure

Code commits

Author Commit Message Commit date
Simon Baslé <sbasle@vmware.com> Simon Baslé <sbasle@vmware.com> 666c8c9a1677ffee75412396a5d66bcac2f02753 666c8c9a1677ffee75412396a5d66bcac2f02753 fix #2502 Generate OSGI Bundle-Version from Europium+ scheme
This commit ensures that the OSGI Bundle-Version is consistently
comparable between snapshots, milestones and release versions using
the new versioning scheme introduced in Europium/2020.0, by forcing
a Bundle-Version similar to the old scheme for OSGI.

Additionally, the OSGI version for snapshots will have a timestamp
appended to it, and said version is also used in export-package.

See reactor/reactor#689 for context.

Reviewed-in: #2505

Error summary for Core

The job generated some errors, drill down into the full build log for more details.

        at org.gradle.api.internal.file.CompositeFileCollection.getFiles(CompositeFileCollection.java:82)
        at org.gradle.api.internal.file.CompositeFileCollection.iterator(CompositeFileCollection.java:69)
        at kotlin.collections.CollectionsKt___CollectionsKt.toCollection(_Collections.kt:1206)
        at kotlin.collections.CollectionsKt___CollectionsKt.toMutableList(_Collections.kt:1239)
        at kotlin.collections.CollectionsKt___CollectionsKt.toList(_Collections.kt:1230)
        at org.jetbrains.kotlin.gradle.internal.KotlinJvmCompilerArgumentsContributor.contributeArguments(CompilerArgumentsContributor.kt:118)
        at org.jetbrains.kotlin.gradle.internal.KotlinJvmCompilerArgumentsContributor.contributeArguments(CompilerArgumentsContributor.kt:80)
        at org.jetbrains.kotlin.gradle.tasks.KotlinCompile.setupCompilerArgs(Tasks.kt:383)
        at org.jetbrains.kotlin.gradle.tasks.KotlinCompile.setupCompilerArgs(Tasks.kt:345)
        at org.jetbrains.kotlin.gradle.internal.CompilerArgumentAware$DefaultImpls.setupCompilerArgs$default(CompilerArgumentAware.kt:40)
        at org.jetbrains.kotlin.gradle.internal.CompilerArgumentAwareKt.prepareCompilerArguments(CompilerArgumentAware.kt:44)
        at org.jetbrains.kotlin.gradle.internal.CompilerArgumentAwareKt.prepareCompilerArguments$default(CompilerArgumentAware.kt:43)
        at org.jetbrains.kotlin.gradle.internal.CompilerArgumentAware$DefaultImpls.getFilteredArgumentsMap(CompilerArgumentAware.kt:37)
        at org.jetbrains.kotlin.gradle.internal.CompilerArgumentAwareWithInput$DefaultImpls.getFilteredArgumentsMap(CompilerArgumentAware.kt:61)
        at org.jetbrains.kotlin.gradle.tasks.AbstractKotlinCompileTool.getFilteredArgumentsMap(Tasks.kt:49)
        at org.jetbrains.kotlin.gradle.tasks.KotlinCompile_Decorated.getFilteredArgumentsMap(Unknown Source)
        at org.gradle.api.internal.tasks.properties.bean.AbstractNestedRuntimeBeanNode$BeanPropertyValue$1$1.create(AbstractNestedRuntimeBeanNode.java:77)
        at org.gradle.internal.deprecation.DeprecationLogger.whileDisabled(DeprecationLogger.java:228)
        at org.gradle.api.internal.tasks.properties.bean.AbstractNestedRuntimeBeanNode$BeanPropertyValue$1.get(AbstractNestedRuntimeBeanNode.java:73)
        at com.google.common.base.Suppliers$NonSerializableMemoizingSupplier.get(Suppliers.java:167)
        at org.gradle.api.internal.tasks.properties.bean.AbstractNestedRuntimeBeanNode$BeanPropertyValue.call(AbstractNestedRuntimeBeanNode.java:133)
        at org.gradle.api.internal.tasks.properties.AbstractValidatingProperty.validate(AbstractValidatingProperty.java:39)
        at org.gradle.api.internal.tasks.properties.DefaultTaskProperties.validate(DefaultTaskProperties.java:193)
        at org.gradle.api.internal.tasks.execution.ExecuteActionsTaskExecuter$TaskExecution.validate(ExecuteActionsTaskExecuter.java:506)
        at org.gradle.internal.execution.steps.ValidateStep.execute(ValidateStep.java:50)
        at org.gradle.internal.execution.steps.SkipEmptyWorkStep.lambda$execute$2(SkipEmptyWorkStep.java:78)
        at org.gradle.internal.execution.steps.SkipEmptyWorkStep.execute(SkipEmptyWorkStep.java:78)
        at org.gradle.internal.execution.steps.SkipEmptyWorkStep.execute(SkipEmptyWorkStep.java:34)
        at org.gradle.internal.execution.steps.legacy.MarkSnapshottingInputsStartedStep.execute(MarkSnapshottingInputsStartedStep.java:39)
        at org.gradle.internal.execution.steps.LoadExecutionStateStep.execute(LoadExecutionStateStep.java:40)
        at org.gradle.internal.execution.steps.LoadExecutionStateStep.execute(LoadExecutionStateStep.java:28)
        at org.gradle.internal.execution.impl.DefaultWorkExecutor.execute(DefaultWorkExecutor.java:33)
        at org.gradle.api.internal.tasks.execution.ExecuteActionsTaskExecuter.executeIfValid(ExecuteActionsTaskExecuter.java:194)
        at org.gradle.api.internal.tasks.execution.ExecuteActionsTaskExecuter.execute(ExecuteActionsTaskExecuter.java:186)
        at org.gradle.api.internal.tasks.execution.CleanupStaleOutputsExecuter.execute(CleanupStaleOutputsExecuter.java:114)
        at org.gradle.api.internal.tasks.execution.FinalizePropertiesTaskExecuter.execute(FinalizePropertiesTaskExecuter.java:46)
        at org.gradle.api.internal.tasks.execution.ResolveTaskExecutionModeExecuter.execute(ResolveTaskExecutionModeExecuter.java:62)
        at org.gradle.api.internal.tasks.execution.SkipTaskWithNoActionsExecuter.execute(SkipTaskWithNoActionsExecuter.java:57)
        at org.gradle.api.internal.tasks.execution.SkipOnlyIfTaskExecuter.execute(SkipOnlyIfTaskExecuter.java:56)
        at org.gradle.api.internal.tasks.execution.CatchExceptionTaskExecuter.execute(CatchExceptionTaskExecuter.java:36)
        at org.gradle.api.internal.tasks.execution.EventFiringTaskExecuter$1.executeTask(EventFiringTaskExecuter.java:77)
        at org.gradle.api.internal.tasks.execution.EventFiringTaskExecuter$1.call(EventFiringTaskExecuter.java:55)
        at org.gradle.api.internal.tasks.execution.EventFiringTaskExecuter$1.call(EventFiringTaskExecuter.java:52)
        at org.gradle.internal.operations.DefaultBuildOperationExecutor$CallableBuildOperationWorker.execute(DefaultBuildOperationExecutor.java:409)
        at org.gradle.internal.operations.DefaultBuildOperationExecutor$CallableBuildOperationWorker.execute(DefaultBuildOperationExecutor.java:399)
        at org.gradle.internal.operations.DefaultBuildOperationExecutor$1.execute(DefaultBuildOperationExecutor.java:157)
        at org.gradle.internal.operations.DefaultBuildOperationExecutor.execute(DefaultBuildOperationExecutor.java:242)
        at org.gradle.internal.operations.DefaultBuildOperationExecutor.execute(DefaultBuildOperationExecutor.java:150)
        at org.gradle.internal.operations.DefaultBuildOperationExecutor.call(DefaultBuildOperationExecutor.java:94)
        at org.gradle.internal.operations.DelegatingBuildOperationExecutor.call(DelegatingBuildOperationExecutor.java:36)
        at org.gradle.api.internal.tasks.execution.EventFiringTaskExecuter.execute(EventFiringTaskExecuter.java:52)
        at org.gradle.execution.plan.LocalTaskNodeExecutor.execute(LocalTaskNodeExecutor.java:41)
        at org.gradle.execution.taskgraph.DefaultTaskExecutionGraph$InvokeNodeExecutorsAction.execute(DefaultTaskExecutionGraph.java:356)
        at org.gradle.execution.taskgraph.DefaultTaskExecutionGraph$InvokeNodeExecutorsAction.execute(DefaultTaskExecutionGraph.java:343)
        at org.gradle.execution.taskgraph.DefaultTaskExecutionGraph$BuildOperationAwareExecutionAction.execute(DefaultTaskExecutionGraph.java:336)
        at org.gradle.execution.taskgraph.DefaultTaskExecutionGraph$BuildOperationAwareExecutionAction.execute(DefaultTaskExecutionGraph.java:322)
        at org.gradle.execution.plan.DefaultPlanExecutor$ExecutorWorker.lambda$run$0(DefaultPlanExecutor.java:127)
        at org.gradle.execution.plan.DefaultPlanExecutor$ExecutorWorker.execute(DefaultPlanExecutor.java:191)
        at org.gradle.execution.plan.DefaultPlanExecutor$ExecutorWorker.executeNextNode(DefaultPlanExecutor.java:182)
        at org.gradle.execution.plan.DefaultPlanExecutor$ExecutorWorker.run(DefaultPlanExecutor.java:124)
        at org.gradle.internal.concurrent.ExecutorPolicy$CatchAndRecordFailures.onExecute(ExecutorPolicy.java:64)
        at org.gradle.internal.concurrent.ManagedExecutorImpl$1.run(ManagedExecutorImpl.java:48)
        at org.gradle.internal.concurrent.ThreadFactoryImpl$ManagedThreadRunnable.run(ThreadFactoryImpl.java:56)
Caused by: org.gradle.api.resources.ResourceException: Could not get resource 'https://repo.spring.io/libs-snapshot/org/openjdk/jcstress/jcstress-core/0.7/jcstress-core-0.7.jar'.
        at org.gradle.internal.resource.ResourceExceptions.failure(ResourceExceptions.java:74)
        at org.gradle.internal.resource.ResourceExceptions.getFailed(ResourceExceptions.java:57)
        at org.gradle.internal.resource.transfer.DefaultCacheAwareExternalResourceAccessor.copyToCache(DefaultCacheAwareExternalResourceAccessor.java:201)
        at org.gradle.internal.resource.transfer.DefaultCacheAwareExternalResourceAccessor.lambda$getResource$1(DefaultCacheAwareExternalResourceAccessor.java:89)
        at org.gradle.cache.internal.ProducerGuard$AdaptiveProducerGuard.guardByKey(ProducerGuard.java:97)
        at org.gradle.internal.resource.transfer.DefaultCacheAwareExternalResourceAccessor.getResource(DefaultCacheAwareExternalResourceAccessor.java:83)
        at org.gradle.api.internal.artifacts.repositories.resolver.DefaultExternalResourceArtifactResolver.downloadByCoords(DefaultExternalResourceArtifactResolver.java:139)
        at org.gradle.api.internal.artifacts.repositories.resolver.DefaultExternalResourceArtifactResolver.downloadStaticResource(DefaultExternalResourceArtifactResolver.java:94)
        at org.gradle.api.internal.artifacts.repositories.resolver.DefaultExternalResourceArtifactResolver.resolveArtifact(DefaultExternalResourceArtifactResolver.java:62)
        at org.gradle.api.internal.artifacts.repositories.resolver.ExternalResourceResolver$RemoteRepositoryAccess.resolveArtifact(ExternalResourceResolver.java:494)
        ... 112 more
Caused by: org.gradle.internal.resource.transport.http.HttpErrorStatusCodeException: Could not GET 'https://repo.spring.io/libs-snapshot/org/openjdk/jcstress/jcstress-core/0.7/jcstress-core-0.7.jar'. Received status code 401 from server: Unauthorized
        at org.gradle.internal.resource.transport.http.HttpClientHelper.processResponse(HttpClientHelper.java:186)
        at org.gradle.internal.resource.transport.http.HttpClientHelper.performGet(HttpClientHelper.java:88)
        at org.gradle.internal.resource.transport.http.HttpResourceAccessor.openResource(HttpResourceAccessor.java:43)
        at org.gradle.internal.resource.transport.http.HttpResourceAccessor.openResource(HttpResourceAccessor.java:28)
        at org.gradle.internal.resource.transfer.DefaultExternalResourceConnector.openResource(DefaultExternalResourceConnector.java:56)
        at org.gradle.internal.resource.transfer.ProgressLoggingExternalResourceAccessor.openResource(ProgressLoggingExternalResourceAccessor.java:38)
        at org.gradle.internal.resource.transfer.AccessorBackedExternalResource.withContentIfPresent(AccessorBackedExternalResource.java:130)
        at org.gradle.internal.resource.BuildOperationFiringExternalResourceDecorator$11.call(BuildOperationFiringExternalResourceDecorator.java:237)
        at org.gradle.internal.resource.BuildOperationFiringExternalResourceDecorator$11.call(BuildOperationFiringExternalResourceDecorator.java:229)
        at org.gradle.internal.operations.DefaultBuildOperationExecutor$CallableBuildOperationWorker.execute(DefaultBuildOperationExecutor.java:409)
        at org.gradle.internal.operations.DefaultBuildOperationExecutor$CallableBuildOperationWorker.execute(DefaultBuildOperationExecutor.java:399)
        at org.gradle.internal.operations.DefaultBuildOperationExecutor$1.execute(DefaultBuildOperationExecutor.java:157)
        at org.gradle.internal.operations.DefaultBuildOperationExecutor.execute(DefaultBuildOperationExecutor.java:242)
        at org.gradle.internal.operations.DefaultBuildOperationExecutor.execute(DefaultBuildOperationExecutor.java:150)
        at org.gradle.internal.operations.DefaultBuildOperationExecutor.call(DefaultBuildOperationExecutor.java:94)
        at org.gradle.internal.operations.DelegatingBuildOperationExecutor.call(DelegatingBuildOperationExecutor.java:36)
        at org.gradle.internal.resource.BuildOperationFiringExternalResourceDecorator.withContentIfPresent(BuildOperationFiringExternalResourceDecorator.java:229)
        at org.gradle.internal.resource.transfer.DefaultCacheAwareExternalResourceAccessor.copyToCache(DefaultCacheAwareExternalResourceAccessor.java:199)
        ... 119 more


* Get more help at https://help.gradle.org

BUILD FAILED in 9m 0s