Build #3,000

Build: #3000 failed Changes by Simon Baslé <sbasle@vmware.com>

Build result summary

Details

Completed
Duration
9 minutes
Labels
None
Agent
bamboo-20.af.pivotal.io
Revision
566b11021802e989ce5945ed0448e067dc243376 566b11021802e989ce5945ed0448e067dc243376
Total tests
7376
Fixed in
#3002 (Changes by Simon Baslé <sbasle@vmware.com>)

Tests

Responsible

No one has taken responsibility for this failure

Code commits

Author Commit Message Commit date
Simon Baslé <sbasle@vmware.com> Simon Baslé <sbasle@vmware.com> 566b11021802e989ce5945ed0448e067dc243376 566b11021802e989ce5945ed0448e067dc243376 Merge-ignore release 3.3.13.RELEASE into master
Spring Buildmaster Spring Buildmaster 5e33011f9b3a9b48b9b68484b8eb42af15977462 m 5e33011f9b3a9b48b9b68484b8eb42af15977462 [artifactory-release] Next development version 3.3.14.BUILD-SNAPSHOT
Spring Buildmaster Spring Buildmaster 808e34c881a0af9767ddc82034a2f849c5395e5c m 808e34c881a0af9767ddc82034a2f849c5395e5c [artifactory-release] Release version 3.3.13.RELEASE
Simon Baslé <sbasle@vmware.com> Simon Baslé <sbasle@vmware.com> 17799abb7f97558f6609aa5c3a030df8fe87523f m 17799abb7f97558f6609aa5c3a030df8fe87523f Prepare release 3.3.13.RELEASE

Tests

New test failures 1
Status Test View job Duration
Collapse Failed BoundedElasticSchedulerTest testGh1973() History
Core 7 secs
java.lang.AssertionError: java.lang.AssertionError: VerifySubscriber timed out on reactor.core.publisher.FluxPeek$PeekSubscriber@2cac5452
java.lang.AssertionError: VerifySubscriber timed out on reactor.core.publisher.FluxPeek$PeekSubscriber@2cac5452
	at reactor.test.MessageFormatter.assertionError(MessageFormatter.java:115)
	at reactor.test.DefaultStepVerifierBuilder$DefaultVerifySubscriber.pollTaskEventOrComplete(DefaultStepVerifierBuilder.java:1683)
	at reactor.test.DefaultStepVerifierBuilder$DefaultVerifySubscriber.verify(DefaultStepVerifierBuilder.java:1260)
	at reactor.test.DefaultStepVerifierBuilder$DefaultStepVerifier.verify(DefaultStepVerifierBuilder.java:824)
	at reactor.core.scheduler.BoundedElasticSchedulerTest.testGh1973(BoundedElasticSchedulerTest.java:1225)
	at sun.reflect.NativeMethodAccessorImpl.invoke0(Native Method)
(87 more lines...)