Build #3,015

Build: #3015 failed Changes by Eric Bottard <[email protected]>

Build result summary

Details

Completed
Duration
9 minutes
Labels
None
Revision
6cc6607998f5885885736e7e8fcb573f0da7b67e 6cc6607998f5885885736e7e8fcb573f0da7b67e
Total tests
7387
Fixed in
#3016 (Changes by Simon Baslé <[email protected]>)

Tests

Responsible

No one has taken responsibility for this failure

Code commits

Author Commit Message Commit date
Eric Bottard <bottarde@vmware.com> Eric Bottard <[email protected]> 6cc6607998f5885885736e7e8fcb573f0da7b67e 6cc6607998f5885885736e7e8fcb573f0da7b67e Merge #2578 into 3.4.3
Eric Bottard <bottarde@vmware.com> Eric Bottard <[email protected]> 89eeb128e1cf022eec58aa0dd0fc89d524bd3587 m 89eeb128e1cf022eec58aa0dd0fc89d524bd3587 fix #2578 skipUntil conditional subscriber logic inconsistent

Tests

New test failures 1
Status Test View job Duration
Collapse Failed OnDiscardShouldNotLeakTest ensureMultipleSubscribersSupportWithNoLeaksWhenRacingCancelAndOnNextAndRequest(boolean, boolean, DiscardScenario)[55] History
Core < 1 sec
java.lang.AssertionError: java.lang.AssertionError: 
Expecting all elements of:
  <[Tracked{ id=1 released=false }]>
to match 'isReleased' predicate but this element did not:
  <Tracked{ id=1 released=false }>
java.lang.AssertionError: 
Expecting all elements of:
  <[Tracked{ id=1 released=false }]>
(147 more lines...)