Build #2,895

Build: #2895 failed

Job: Core failed

Stages & jobs

  1. Default Stage

Eviction: Test case result

The below summarizes the result of the test "Eviction" in build 2,895 of Project Reactor - Reactor Core NEXT - Core. View test case history
Description
Eviction
Test class
reactor.core.scheduler.ElasticSchedulerTest
Method
eviction
Duration
< 1 sec
Status
Failed (New Failure)

Error Log

java.lang.AssertionError: java.lang.AssertionError: 
Expecting empty but was:<[reactor.core.scheduler.ElasticScheduler$CachedService@74efa902]>
java.lang.AssertionError: 
Expecting empty but was:<[reactor.core.scheduler.ElasticScheduler$CachedService@74efa902]>
	at reactor.core.scheduler.ElasticSchedulerTest.eviction(ElasticSchedulerTest.java:102)
	at sun.reflect.NativeMethodAccessorImpl.invoke0(Native Method)
	at sun.reflect.NativeMethodAccessorImpl.invoke(NativeMethodAccessorImpl.java:62)
	at sun.reflect.DelegatingMethodAccessorImpl.invoke(DelegatingMethodAccessorImpl.java:43)
	at java.lang.reflect.Method.invoke(Method.java:498)
	at org.junit.runners.model.FrameworkMethod$1.runReflectiveCall(FrameworkMethod.java:59)
	at org.junit.internal.runners.model.ReflectiveCallable.run(ReflectiveCallable.java:12)
	at org.junit.runners.model.FrameworkMethod.invokeExplosively(FrameworkMethod.java:56)
	at org.junit.internal.runners.statements.InvokeMethod.evaluate(InvokeMethod.java:17)
	at org.junit.internal.runners.statements.FailOnTimeout$CallableStatement.call(FailOnTimeout.java:288)
	at org.junit.internal.runners.statements.FailOnTimeout$CallableStatement.call(FailOnTimeout.java:282)
	at java.util.concurrent.FutureTask.run(FutureTask.java:237)
	at java.lang.Thread.run(Thread.java:748)