Build #2,989

Build: #2989 was successful

Job: Core was successful

Stages & jobs

  1. Default Stage

Build log

The build generated 1,337 lines of output.The output is too long and has been truncated to the last 1,000 lines. Download or view full build log

04-Dec-2020 16:42:58 Resolving deltas:   1% (368/34348)   
04-Dec-2020 16:42:58 Resolving deltas:   2% (742/34348)   
04-Dec-2020 16:42:58 Resolving deltas:   3% (1063/34348)   
04-Dec-2020 16:42:58 Resolving deltas:   4% (1386/34348)   
04-Dec-2020 16:42:58 Resolving deltas:   5% (1788/34348)   
04-Dec-2020 16:42:58 Resolving deltas:   6% (2158/34348)   
04-Dec-2020 16:42:58 Resolving deltas:   7% (2460/34348)   
04-Dec-2020 16:42:58 Resolving deltas:   8% (2820/34348)   
04-Dec-2020 16:42:58 Resolving deltas:   9% (3109/34348)   
04-Dec-2020 16:42:58 Resolving deltas:  10% (3465/34348)   
04-Dec-2020 16:42:58 Resolving deltas:  11% (3889/34348)   
04-Dec-2020 16:42:58 Resolving deltas:  12% (4122/34348)   
04-Dec-2020 16:42:58 Resolving deltas:  13% (4470/34348)   
04-Dec-2020 16:42:58 Resolving deltas:  14% (4813/34348)   
04-Dec-2020 16:42:58 Resolving deltas:  15% (5166/34348)   
04-Dec-2020 16:42:58 Resolving deltas:  16% (5503/34348)   
04-Dec-2020 16:42:58 Resolving deltas:  17% (5863/34348)   
04-Dec-2020 16:42:58 Resolving deltas:  18% (6196/34348)   
04-Dec-2020 16:42:58 Resolving deltas:  19% (6567/34348)   
04-Dec-2020 16:42:58 Resolving deltas:  20% (6881/34348)   
04-Dec-2020 16:42:58 Resolving deltas:  21% (7327/34348)   
04-Dec-2020 16:42:58 Resolving deltas:  22% (7570/34348)   
04-Dec-2020 16:42:58 Resolving deltas:  23% (7914/34348)   
04-Dec-2020 16:42:58 Resolving deltas:  24% (8281/34348)   
04-Dec-2020 16:42:58 Resolving deltas:  25% (8595/34348)   
04-Dec-2020 16:42:58 Resolving deltas:  26% (8936/34348)   
04-Dec-2020 16:42:58 Resolving deltas:  27% (9290/34348)   
04-Dec-2020 16:42:58 Resolving deltas:  28% (9635/34348)   
04-Dec-2020 16:42:58 Resolving deltas:  29% (10011/34348)   
04-Dec-2020 16:42:58 Resolving deltas:  30% (10337/34348)   
04-Dec-2020 16:42:58 Resolving deltas:  31% (10650/34348)   
04-Dec-2020 16:42:58 Resolving deltas:  32% (11009/34348)   
04-Dec-2020 16:42:58 Resolving deltas:  33% (11336/34348)   
04-Dec-2020 16:42:58 Resolving deltas:  34% (11680/34348)   
04-Dec-2020 16:42:58 Resolving deltas:  35% (12043/34348)   
04-Dec-2020 16:42:58 Resolving deltas:  36% (12375/34348)   
04-Dec-2020 16:42:59 Resolving deltas:  37% (12717/34348)   
04-Dec-2020 16:42:59 Resolving deltas:  38% (13080/34348)   
04-Dec-2020 16:42:59 Resolving deltas:  39% (13407/34348)   
04-Dec-2020 16:42:59 Resolving deltas:  40% (13777/34348)   
04-Dec-2020 16:42:59 Resolving deltas:  41% (14140/34348)   
04-Dec-2020 16:42:59 Resolving deltas:  42% (14468/34348)   
04-Dec-2020 16:42:59 Resolving deltas:  43% (14785/34348)   
04-Dec-2020 16:42:59 Resolving deltas:  44% (15143/34348)   
04-Dec-2020 16:42:59 Resolving deltas:  45% (15463/34348)   
04-Dec-2020 16:42:59 Resolving deltas:  46% (15818/34348)   
04-Dec-2020 16:42:59 Resolving deltas:  47% (16245/34348)   
04-Dec-2020 16:42:59 Resolving deltas:  48% (16510/34348)   
04-Dec-2020 16:42:59 Resolving deltas:  49% (16889/34348)   
04-Dec-2020 16:42:59 Resolving deltas:  50% (17185/34348)   
04-Dec-2020 16:42:59 Resolving deltas:  51% (17527/34348)   
04-Dec-2020 16:42:59 Resolving deltas:  52% (17897/34348)   
04-Dec-2020 16:42:59 Resolving deltas:  53% (18215/34348)   
04-Dec-2020 16:42:59 Resolving deltas:  54% (18567/34348)   
04-Dec-2020 16:42:59 Resolving deltas:  55% (18913/34348)   
04-Dec-2020 16:42:59 Resolving deltas:  56% (19360/34348)   
04-Dec-2020 16:42:59 Resolving deltas:  57% (19590/34348)   
04-Dec-2020 16:42:59 Resolving deltas:  58% (19928/34348)   
04-Dec-2020 16:42:59 Resolving deltas:  59% (20284/34348)   
04-Dec-2020 16:42:59 Resolving deltas:  60% (20689/34348)   
04-Dec-2020 16:42:59 Resolving deltas:  61% (21052/34348)   
04-Dec-2020 16:42:59 Resolving deltas:  62% (21300/34348)   
04-Dec-2020 16:42:59 Resolving deltas:  63% (21649/34348)   
04-Dec-2020 16:42:59 Resolving deltas:  64% (21998/34348)   
04-Dec-2020 16:42:59 Resolving deltas:  65% (22366/34348)   
04-Dec-2020 16:42:59 Resolving deltas:  66% (22674/34348)   
04-Dec-2020 16:42:59 Resolving deltas:  67% (23017/34348)   
04-Dec-2020 16:42:59 Resolving deltas:  68% (23358/34348)   
04-Dec-2020 16:42:59 Resolving deltas:  69% (23701/34348)   
04-Dec-2020 16:42:59 Resolving deltas:  70% (24104/34348)   
04-Dec-2020 16:42:59 Resolving deltas:  71% (24388/34348)   
04-Dec-2020 16:42:59 Resolving deltas:  72% (24736/34348)   
04-Dec-2020 16:42:59 Resolving deltas:  73% (25078/34348)   
04-Dec-2020 16:42:59 Resolving deltas:  74% (25458/34348)   
04-Dec-2020 16:42:59 Resolving deltas:  75% (25767/34348)   
04-Dec-2020 16:42:59 Resolving deltas:  76% (26109/34348)   
04-Dec-2020 16:42:59 Resolving deltas:  77% (26458/34348)   
04-Dec-2020 16:42:59 Resolving deltas:  78% (26806/34348)   
04-Dec-2020 16:42:59 Resolving deltas:  79% (27145/34348)   
04-Dec-2020 16:42:59 Resolving deltas:  80% (27512/34348)   
04-Dec-2020 16:42:59 Resolving deltas:  81% (27836/34348)   
04-Dec-2020 16:42:59 Resolving deltas:  82% (28257/34348)   
04-Dec-2020 16:42:59 Resolving deltas:  83% (28534/34348)   
04-Dec-2020 16:42:59 Resolving deltas:  84% (28875/34348)   
04-Dec-2020 16:42:59 Resolving deltas:  85% (29207/34348)   
04-Dec-2020 16:42:59 Resolving deltas:  86% (29821/34348)   
04-Dec-2020 16:42:59 Resolving deltas:  87% (29900/34348)   
04-Dec-2020 16:42:59 Resolving deltas:  88% (30307/34348)   
04-Dec-2020 16:42:59 Resolving deltas:  89% (30606/34348)   
04-Dec-2020 16:42:59 Resolving deltas:  90% (30938/34348)   
04-Dec-2020 16:42:59 Resolving deltas:  91% (31263/34348)   
04-Dec-2020 16:42:59 Resolving deltas:  92% (31670/34348)   
04-Dec-2020 16:42:59 Resolving deltas:  93% (31945/34348)   
04-Dec-2020 16:42:59 Resolving deltas:  94% (32292/34348)   
04-Dec-2020 16:42:59 Resolving deltas:  95% (32631/34348)   
04-Dec-2020 16:42:59 Resolving deltas:  96% (32981/34348)   
04-Dec-2020 16:42:59 Resolving deltas:  97% (33319/34348)   
04-Dec-2020 16:42:59 Resolving deltas:  98% (33665/34348)   
04-Dec-2020 16:42:59 Resolving deltas:  99% (34009/34348)   
04-Dec-2020 16:42:59 Resolving deltas: 100% (34348/34348)   
04-Dec-2020 16:42:59 Resolving deltas: 100% (34348/34348), done.
04-Dec-2020 16:42:59 From https://github.com/reactor/reactor-core
04-Dec-2020 16:42:59 * [new branch]      master     -> master
04-Dec-2020 16:42:59 * [new tag]           v2.5.0.M1       -> v2.5.0.M1
04-Dec-2020 16:42:59 * [new tag]           v2.5.0.M2       -> v2.5.0.M2
04-Dec-2020 16:42:59 * [new tag]           v2.5.0.M3       -> v2.5.0.M3
04-Dec-2020 16:42:59 * [new tag]           v2.5.0.M4       -> v2.5.0.M4
04-Dec-2020 16:42:59 * [new tag]           v3.0.0.RC1      -> v3.0.0.RC1
04-Dec-2020 16:42:59 * [new tag]           v3.0.0.RC2      -> v3.0.0.RC2
04-Dec-2020 16:42:59 * [new tag]           v3.0.0.RELEASE  -> v3.0.0.RELEASE
04-Dec-2020 16:42:59 * [new tag]           v3.0.1.RELEASE  -> v3.0.1.RELEASE
04-Dec-2020 16:42:59 * [new tag]           v3.0.2.RELEASE  -> v3.0.2.RELEASE
04-Dec-2020 16:42:59 * [new tag]           v3.0.3.RELEASE  -> v3.0.3.RELEASE
04-Dec-2020 16:42:59 * [new tag]           v3.0.4.RELEASE  -> v3.0.4.RELEASE
04-Dec-2020 16:42:59 * [new tag]           v3.0.5.RELEASE  -> v3.0.5.RELEASE
04-Dec-2020 16:42:59 * [new tag]           v3.0.6.RELEASE  -> v3.0.6.RELEASE
04-Dec-2020 16:42:59 * [new tag]           v3.1.0.M1       -> v3.1.0.M1
04-Dec-2020 16:42:59 * [new tag]           v3.1.0.M2       -> v3.1.0.M2
04-Dec-2020 16:42:59 * [new tag]           v3.1.0.RELEASE  -> v3.1.0.RELEASE
04-Dec-2020 16:42:59 * [new tag]           v3.1.1.RELEASE  -> v3.1.1.RELEASE
04-Dec-2020 16:42:59 * [new tag]           v3.1.10.RELEASE -> v3.1.10.RELEASE
04-Dec-2020 16:42:59 * [new tag]           v3.1.11.RELEASE -> v3.1.11.RELEASE
04-Dec-2020 16:42:59 * [new tag]           v3.1.12.RELEASE -> v3.1.12.RELEASE
04-Dec-2020 16:42:59 * [new tag]           v3.1.13.RELEASE -> v3.1.13.RELEASE
04-Dec-2020 16:42:59 * [new tag]           v3.1.14.RELEASE -> v3.1.14.RELEASE
04-Dec-2020 16:42:59 * [new tag]           v3.1.15.RELEASE -> v3.1.15.RELEASE
04-Dec-2020 16:42:59 * [new tag]           v3.1.16.RELEASE -> v3.1.16.RELEASE
04-Dec-2020 16:42:59 * [new tag]           v3.1.2.RELEASE  -> v3.1.2.RELEASE
04-Dec-2020 16:42:59 * [new tag]           v3.1.3.RELEASE  -> v3.1.3.RELEASE
04-Dec-2020 16:42:59 * [new tag]           v3.1.4.RELEASE  -> v3.1.4.RELEASE
04-Dec-2020 16:42:59 * [new tag]           v3.1.5.RELEASE  -> v3.1.5.RELEASE
04-Dec-2020 16:42:59 * [new tag]           v3.1.6.RELEASE  -> v3.1.6.RELEASE
04-Dec-2020 16:42:59 * [new tag]           v3.1.7.RELEASE  -> v3.1.7.RELEASE
04-Dec-2020 16:42:59 * [new tag]           v3.1.8.RELEASE  -> v3.1.8.RELEASE
04-Dec-2020 16:42:59 * [new tag]           v3.1.9.RELEASE  -> v3.1.9.RELEASE
04-Dec-2020 16:42:59 * [new tag]           v3.2.0.M2       -> v3.2.0.M2
04-Dec-2020 16:42:59 * [new tag]           v3.2.0.M3       -> v3.2.0.M3
04-Dec-2020 16:42:59 * [new tag]           v3.2.0.M4       -> v3.2.0.M4
04-Dec-2020 16:42:59 * [new tag]           v3.2.0.RC1      -> v3.2.0.RC1
04-Dec-2020 16:42:59 * [new tag]           v3.2.0.RELEASE  -> v3.2.0.RELEASE
04-Dec-2020 16:42:59 * [new tag]           v3.2.1.RELEASE  -> v3.2.1.RELEASE
04-Dec-2020 16:42:59 * [new tag]           v3.2.10.RELEASE -> v3.2.10.RELEASE
04-Dec-2020 16:42:59 * [new tag]           v3.2.12.RELEASE -> v3.2.12.RELEASE
04-Dec-2020 16:42:59 * [new tag]           v3.2.13.RELEASE -> v3.2.13.RELEASE
04-Dec-2020 16:42:59 * [new tag]           v3.2.14.RELEASE -> v3.2.14.RELEASE
04-Dec-2020 16:42:59 * [new tag]           v3.2.15.RELEASE -> v3.2.15.RELEASE
04-Dec-2020 16:42:59 * [new tag]           v3.2.16.RELEASE -> v3.2.16.RELEASE
04-Dec-2020 16:42:59 * [new tag]           v3.2.17.RELEASE -> v3.2.17.RELEASE
04-Dec-2020 16:42:59 * [new tag]           v3.2.18.RELEASE -> v3.2.18.RELEASE
04-Dec-2020 16:42:59 * [new tag]           v3.2.19.RELEASE -> v3.2.19.RELEASE
04-Dec-2020 16:42:59 * [new tag]           v3.2.2.RELEASE  -> v3.2.2.RELEASE
04-Dec-2020 16:42:59 * [new tag]           v3.2.20.RELEASE -> v3.2.20.RELEASE
04-Dec-2020 16:42:59 * [new tag]           v3.2.21.RELEASE -> v3.2.21.RELEASE
04-Dec-2020 16:42:59 * [new tag]           v3.2.3.RELEASE  -> v3.2.3.RELEASE
04-Dec-2020 16:42:59 * [new tag]           v3.2.4.RELEASE  -> v3.2.4.RELEASE
04-Dec-2020 16:42:59 * [new tag]           v3.2.5.RELEASE  -> v3.2.5.RELEASE
04-Dec-2020 16:42:59 * [new tag]           v3.2.6.RELEASE  -> v3.2.6.RELEASE
04-Dec-2020 16:42:59 * [new tag]           v3.2.7.RELEASE  -> v3.2.7.RELEASE
04-Dec-2020 16:42:59 * [new tag]           v3.2.8.RELEASE  -> v3.2.8.RELEASE
04-Dec-2020 16:42:59 * [new tag]           v3.2.9.RELEASE  -> v3.2.9.RELEASE
04-Dec-2020 16:42:59 * [new tag]           v3.3.0.M1       -> v3.3.0.M1
04-Dec-2020 16:42:59 * [new tag]           v3.3.0.M2       -> v3.3.0.M2
04-Dec-2020 16:42:59 * [new tag]           v3.3.0.M3       -> v3.3.0.M3
04-Dec-2020 16:42:59 * [new tag]           v3.3.0.RC1      -> v3.3.0.RC1
04-Dec-2020 16:42:59 * [new tag]           v3.3.0.RELEASE  -> v3.3.0.RELEASE
04-Dec-2020 16:42:59 * [new tag]           v3.3.1.RELEASE  -> v3.3.1.RELEASE
04-Dec-2020 16:42:59 * [new tag]           v3.3.10.RELEASE -> v3.3.10.RELEASE
04-Dec-2020 16:42:59 * [new tag]           v3.3.11.RELEASE -> v3.3.11.RELEASE
04-Dec-2020 16:42:59 * [new tag]           v3.3.2.RELEASE  -> v3.3.2.RELEASE
04-Dec-2020 16:42:59 * [new tag]           v3.3.3.RELEASE  -> v3.3.3.RELEASE
04-Dec-2020 16:42:59 * [new tag]           v3.3.4.RELEASE  -> v3.3.4.RELEASE
04-Dec-2020 16:42:59 * [new tag]           v3.3.5.RELEASE  -> v3.3.5.RELEASE
04-Dec-2020 16:42:59 * [new tag]           v3.3.6.RELEASE  -> v3.3.6.RELEASE
04-Dec-2020 16:42:59 * [new tag]           v3.3.7.RELEASE  -> v3.3.7.RELEASE
04-Dec-2020 16:42:59 * [new tag]           v3.3.8.RELEASE  -> v3.3.8.RELEASE
04-Dec-2020 16:42:59 * [new tag]           v3.3.9.RELEASE  -> v3.3.9.RELEASE
04-Dec-2020 16:42:59 * [new tag]           v3.4.0          -> v3.4.0
04-Dec-2020 16:42:59 * [new tag]           v3.4.0-M1       -> v3.4.0-M1
04-Dec-2020 16:42:59 * [new tag]           v3.4.0-M2       -> v3.4.0-M2
04-Dec-2020 16:42:59 * [new tag]           v3.4.0-RC1      -> v3.4.0-RC1
04-Dec-2020 16:42:59 * [new tag]           v3.4.0-RC2      -> v3.4.0-RC2
04-Dec-2020 16:42:59 Checking out revision 7ce3f4b2911848b961711372456ed49d42f5760c.
04-Dec-2020 16:42:59 /usr/bin/git show-ref master
04-Dec-2020 16:42:59 /usr/bin/git checkout -f master
04-Dec-2020 16:43:00 Already on 'master'
04-Dec-2020 16:43:00 /usr/bin/git remote set-url origin file://nothing
04-Dec-2020 16:43:00 Updated source code to revision: 7ce3f4b2911848b961711372456ed49d42f5760c
04-Dec-2020 16:43:00 Finished task 'checkout' with result: Success
04-Dec-2020 16:43:00 Running pre-build action: Artifactory Release Staging
04-Dec-2020 16:43:00 Running pre-build action: VCS Version Collector
04-Dec-2020 16:43:00
Substituting variable: ${bamboo.customGradle} with
04-Dec-2020 16:43:00 Starting task 'Build Test Assemble' of type 'org.jfrog.bamboo.bamboo-artifactory-plugin:artifactoryGradleTask'
04-Dec-2020 16:43:00 Bamboo Artifactory Plugin version: 3.0.1
04-Dec-2020 16:43:00
Beginning to execute external process for build 'Project Reactor - Reactor Core NEXT - Core #2989 (REACTOR-RNEXT-JOB1-2989)'
... running command line:
./gradlew --stacktrace --no-daemon -PversionBranch= clean check assemble -DbuildInfoConfig.propertiesFile=/tmp/buildinfo1558280211341408401properties artifactoryPublish -Dartifactory.resolve.password=******** -Dartifactory.publish.password=********
... in: /opt/bamboo-home/xml-data/build-dir/REACTOR-RNEXT-JOB1
... using extra environment variables:
bamboo_planRepository_1_branch=master
bamboo_********_username_password=********
bamboo_signing_store_password=********
bamboo_capability_system_builder_ant_Ant_1_9=/opt/ant-1.9
bamboo_capability_system_builder_ant_Ant_1_8=/opt/ant-1.8
bamboo_planRepository_1_branchDisplayName=master
bamboo_artifactory_override_resolve_repo=libs-milestone
bamboo_capability_system_builder_node_Node_js_10_16=/opt/node-10.16/bin/node
bamboo_repository_revision_number=7ce3f4b2911848b961711372456ed49d42f5760c
WRAPPER_BITS=32
bamboo_buildKey=REACTOR-RNEXT-JOB1
bamboo_ge_cache_username=ci
bamboo_bintray_password=********
bamboo_gradle_enterprise_cache_user=ci
bamboo_sonar_token_password=********
PWD=/opt/bamboo-home/bin
bamboo_shortJobName=Core
bamboo_artifactory_override_resolver_password=********
bamboo_sonatype_token=RSJChaox
bamboo_capability_system_builder_gradle___gradlew=./gradlew
bamboo_buildResultsUrl=https://build.spring.io/browse/REACTOR-RNEXT-JOB1-2989
bamboo_repository_239173635_git_username=spring-buildmaster
bamboo_capability_system_builder_mvn3_Maven_3_3=/opt/maven-3.3
bamboo_capability_system_builder_mvn3_Maven_3_2=/opt/maven-3.2
bamboo_capability_system_builder_mvn3_Maven_3_1=/opt/maven-3.1
bamboo_planRepository_repositoryUrl=https://github.com/reactor/reactor-core.git
bamboo_repository_239173635_branch_name=master
bamboo_capability_system_builder_mvn3_Maven_3_6=/opt/maven-3.6
bamboo_agentId=286195722
bamboo_capability_system_builder_mvn3_Maven_3_5=/opt/maven-3.5
bamboo_capability_system_builder_mvn3_Maven_3_0=/opt/maven-3.0
bamboo_planRepository_revision=7ce3f4b2911848b961711372456ed49d42f5760c
bamboo_planRepository_previousRevision=2e9ce5541ca3ba7e6198a38ef53ecdd3d97f2b91
bamboo_capability_remote_build=true
bamboo_repository_branch_name=master
bamboo_sonatype_token_password=********
bamboo_sonatype_user=springsource
SHLVL=1
bamboo_gradle_enterprise_cache_password=********
bamboo_org_jfrog_bamboo_buildInfo_serverUrl=https://repo.spring.io
bamboo_scdf_acceptance_tests_password=********
bamboo_APPLE_AC_PASSWORD=********
WRAPPER_OS=linux
JAVA_HOME=/opt/jdk-8/
TERM=linux
XDG_SESSION_ID=c1
bamboo_gradle_enterprise_secret_access_key=********
bamboo_repository_239173635_previous_revision_number=2e9ce5541ca3ba7e6198a38ef53ecdd3d97f2b91
bamboo_planRepository_branch=master
bamboo_org_jfrog_bamboo_release_activated=false
bamboo_capability_system_jdk_JDK_15=/opt/jdk-15
bamboo_capability_system_jdk_JDK_13=/opt/jdk-13
bamboo_capability_system_jdk_JDK_14=/opt/jdk-14
bamboo_planRepository_1_type=gitv2
bamboo_planRepository_branchName=master
bamboo_capability_system_jdk_JDK_12=/opt/jdk-12
WRAPPER_FILE_SEPARATOR=/
_=/opt/bamboo-home/bin/bamboo-agent.sh
bamboo_capability_system_builder_gradlew_gradlew=./
bamboo_capability_system_builder_ant_Ant_1_10=/opt/ant-1.10
WRAPPER_PATH_SEPARATOR=:
bamboo_sonar_password=********
bamboo_hg_cache_directory=/opt/bamboo-home/xml-data/build-dir/_hg-repositories-cache
bamboo_planRepository_1_username=spring-buildmaster
bamboo_planRepository_type=gitv2
bamboo_git_cache_directory=/opt/bamboo-home/xml-data/build-dir/_git-repositories-cache
bamboo_repository_239173635_git_branch=master
bamboo_artifactory_username=buildmaster
bamboo_tmp_directory=/opt/bamboo-home/temp
bamboo_planKey=REACTOR-RNEXT
bamboo_planRepository_username=spring-buildmaster
bamboo_JDK8_HOME=/opt/jdk-8
bamboo_planRepository_1_branchName=master
bamboo_sonar_version=6.7.7
bamboo_sonar_jdbc_password=********
bamboo_bintray_api_key_password=********
XDG_DATA_DIRS=/usr/local/share:/usr/share:/var/lib/snapd/desktop
bamboo_dockerhub_password=********
bamboo_capability_system_jdk_JDK_1_11=/opt/jdk-11
bamboo_resultsUrl=https://build.spring.io/browse/REACTOR-RNEXT-JOB1-2989
bamboo_APPLE_AC_USERNAME_PASSWORD=********
bamboo_capability_system_jdk_JDK_1_10=/opt/jdk-10
bamboo_build_working_directory=/opt/bamboo-home/xml-data/build-dir/REACTOR-RNEXT-JOB1
bamboo_planRepository_1_name=reactor-core
bamboo_capability_system_os=ubuntu1804
bamboo_nexusPush_stagingProfile=buildmaster
bamboo_shortPlanName=Reactor Core NEXT
MAIL=/var/mail/bamboo
bamboo_customGradle=
bamboo_planRepository_name=reactor-core
LOGNAME=bamboo
bamboo_buildNumber=2989
SHELL=/bin/bash
bamboo_planName=Project Reactor - Reactor Core NEXT
bamboo_JDK7_HOME=/opt/jdk-7
bamboo_shortPlanKey=RNEXT
OLDPWD=/opt/users/bamboo
bamboo_shortJobKey=JOB1
bamboo_artifactory_password=********
bamboo_repository_239173635_git_repositoryUrl=https://github.com/reactor/reactor-core.git
bamboo_buildTimeStamp=2020-12-04T16:42:46.493Z
bamboo_repository_previous_revision_number=2e9ce5541ca3ba7e6198a38ef53ecdd3d97f2b91
bamboo_sonar_username=buildmaster
bamboo_********_password=********
bamboo_repository_git_branch=master
bamboo_buildResultKey=REACTOR-RNEXT-JOB1-2989
bamboo_nexusPush_close=true
bamboo_artifactory_override_resolver_username=buildmaster
bamboo_buildPlanName=Project Reactor - Reactor Core NEXT - Core
bamboo_planRepository_1_revision=7ce3f4b2911848b961711372456ed49d42f5760c
bamboo_repository_name=reactor-core
bamboo_signing_key_password=********
bamboo_capability_system_builder_groovy_Groovy_2_5=/opt/groovy-2.5
LANG=en_US.UTF-8
bamboo_buildFailed=false
bamboo_capability_system_docker_executable=/usr/bin/docker
DISPLAY=localhost:1.0
bamboo_capability_system_jdk_OpenJDK_7=/opt/jdk-7
bamboo_capability_system_builder_groovy_Groovy_2_4=/opt/groovy-2.4
bamboo_artifactory_override_deployer_username=buildmaster
bamboo_artifactory_password_mask_b=********
bamboo_capability_system_builder_command_Bash=/bin/bash
bamboo_artifactory_password_mask_a=********
bamboo_agentWorkingDirectory=/opt/bamboo-home/xml-data/build-dir
bamboo_capability_system_git_executable=/usr/bin/git
bamboo_repository_git_username=spring-buildmaster
bamboo_planRepository_1_previousRevision=2e9ce5541ca3ba7e6198a38ef53ecdd3d97f2b91
bamboo_capability_os_family=unix
bamboo_planRepository_branchDisplayName=master
bamboo_capability_system_builder_maven_Artifactory_Maven_3_6=/opt/maven-3.6
bamboo_capability_system_builder_maven_Artifactory_Maven_3_5=/opt/maven-3.5
GIT_SSL_NO_VERIFY=true
bamboo_capability_system_builder_maven_Artifactory_Maven_3_3=/opt/maven-3.3
bamboo_capability_system_builder_maven_Artifactory_Maven_3_2=/opt/maven-3.2
bamboo_s3_properties=/home/bamboo/tools/s3.properties
bamboo_capability_system_builder_maven_Artifactory_Maven_3_1=/opt/maven-3.1
bamboo_artifactory_override_deploy_repo=libs-snapshot-local
bamboo_capability_system_builder_maven_Artifactory_Maven_3_0=/opt/maven-3.0
bamboo_plan_storageTag=REACTOR-RNEXT
bamboo_repository_239173635_name=reactor-core
bamboo_bintray_username_password=********
USER=bamboo
bamboo_repository_git_repositoryUrl=https://github.com/reactor/reactor-core.git
bamboo_repository_239173635_revision_number=7ce3f4b2911848b961711372456ed49d42f5760c
bamboo_working_directory=/opt/bamboo-home/xml-data/build-dir/REACTOR-RNEXT-JOB1
bamboo_org_jfrog_bamboo_buildInfo_activated=true
bamboo_planRepository_1_repositoryUrl=https://github.com/reactor/reactor-core.git
bamboo_capability_system_jdk_JDK_1_8=/opt/jdk-8
bamboo_artifactory_override_deployer_password=********
bamboo_capability_system_jdk_JDK_1_9=/opt/jdk-9
bamboo_dockerhub_username_password=********
WRAPPER_ARCH=x86
bamboo_capability_system_jdk_JDK_1_6=/opt/jdk-6
bamboo_sonatype_password=********
bamboo_capability_system_jdk_JDK_1_7=/opt/jdk-7
bamboo_sonar_ip=10.194.6.9
XDG_RUNTIME_DIR=/run/user/1002
HOME=/home/bamboo
bamboo_ge_cache_password=********
PATH=/bin:/home/bamboo/bin:/usr/local/sbin:/usr/local/bin:/usr/sbin:/usr/bin:/sbin:/bin:/usr/games:/usr/local/games:/snap/bin:/home/bamboo/bin:/usr/local/bin:/bin:/home/bamboo/bin:/usr/local/sbin:/usr/local/bin:/usr/sbin:/usr/bin:/sbin:/bin:/usr/games:/usr/local/games:/snap/bin:/home/bamboo/bin:/usr/local/bin
04-Dec-2020 16:43:01 To honour the JVM settings for this build a new JVM will be forked. Please consider using the daemon: https://docs.gradle.org/6.5.1/userguide/gradle_daemon.html.
04-Dec-2020 16:43:02 Daemon will be stopped at the end of the build stopping after processing
04-Dec-2020 16:43:08 > Task :buildSrc:compileJava
04-Dec-2020 16:43:08 > Task :buildSrc:compileGroovy NO-SOURCE
04-Dec-2020 16:43:08 > Task :buildSrc:pluginDescriptors
04-Dec-2020 16:43:08 > Task :buildSrc:processResources
04-Dec-2020 16:43:08 > Task :buildSrc:classes
04-Dec-2020 16:43:08 > Task :buildSrc:jar
04-Dec-2020 16:43:08 > Task :buildSrc:assemble
04-Dec-2020 16:43:08 > Task :buildSrc:pluginUnderTestMetadata
04-Dec-2020 16:43:09
04-Dec-2020 16:43:09 > Task :buildSrc:compileTestJava
04-Dec-2020 16:43:09
04-Dec-2020 16:43:09 > Task :buildSrc:compileTestGroovy NO-SOURCE
04-Dec-2020 16:43:09 > Task :buildSrc:processTestResources NO-SOURCE
04-Dec-2020 16:43:09 > Task :buildSrc:testClasses
04-Dec-2020 16:43:09 Note: /opt/bamboo-home/xml-data/build-dir/REACTOR-RNEXT-JOB1/buildSrc/src/test/java/io/reactor/gradle/DetectCiPluginTest.java uses unchecked or unsafe operations.
04-Dec-2020 16:43:09 Note: Recompile with -Xlint:unchecked for details.
04-Dec-2020 16:43:17 > Task :buildSrc:test
04-Dec-2020 16:43:17 > Task :buildSrc:validatePlugins
04-Dec-2020 16:43:17 > Task :buildSrc:check
04-Dec-2020 16:43:17 > Task :buildSrc:build
04-Dec-2020 16:43:24
04-Dec-2020 16:43:24 > Configure project :
04-Dec-2020 16:43:24 Detected CI environment: [bamboo_planKey]
04-Dec-2020 16:43:25 JDK Javadoc link for this build is https://docs.oracle.com/javase/8/docs/api/
04-Dec-2020 16:43:25 3.4.1-SNAPSHOT is a snapshot, will use 3.4.1.BUILD-202012041643 for bnd
04-Dec-2020 16:43:29
04-Dec-2020 16:43:29 > Configure project :reactor-core
04-Dec-2020 16:43:29 Will download and perform baseline comparison with 3.4.0
04-Dec-2020 16:43:29 Applying Kotlin conventions to reactor-core
04-Dec-2020 16:43:30
04-Dec-2020 16:43:30 > Configure project :reactor-test
04-Dec-2020 16:43:30 Will download and perform baseline comparison with 3.4.0
04-Dec-2020 16:43:30 Applying Kotlin conventions to reactor-test
04-Dec-2020 16:43:32
04-Dec-2020 16:43:32 > Task :clean UP-TO-DATE
04-Dec-2020 16:43:32 > Task :benchmarks:clean UP-TO-DATE
04-Dec-2020 16:43:32 > Task :reactor-core:clean
04-Dec-2020 16:43:32 > Task :reactor-test:clean UP-TO-DATE
04-Dec-2020 16:43:32 > Task :reactor-tools:clean UP-TO-DATE
04-Dec-2020 16:43:32 > Task :check UP-TO-DATE
04-Dec-2020 16:43:35 > Task :benchmarks:compileJava
04-Dec-2020 16:43:35 > Task :benchmarks:processResources
04-Dec-2020 16:43:35 > Task :benchmarks:classes
04-Dec-2020 16:43:35 > Task :benchmarks:compileTestJava NO-SOURCE
04-Dec-2020 16:43:35 > Task :benchmarks:processTestResources NO-SOURCE
04-Dec-2020 16:43:35 > Task :benchmarks:testClasses UP-TO-DATE
04-Dec-2020 16:43:35 > Task :benchmarks:test NO-SOURCE
04-Dec-2020 16:43:35 > Task :benchmarks:check UP-TO-DATE
04-Dec-2020 16:43:36 > Task :reactor-core:compileJava9stubsKotlin
04-Dec-2020 16:43:36
04-Dec-2020 16:43:36 > Task :reactor-core:compileJava9stubsJava
04-Dec-2020 16:43:36 /opt/bamboo-home/xml-data/build-dir/REACTOR-RNEXT-JOB1/reactor-core/src/main/java9stubs/java/lang/StackWalker.java:6: warning: CallerSensitive is internal proprietary API and may be removed in a future release
04-Dec-2020 16:43:36 import sun.reflect.CallerSensitive;
04-Dec-2020 16:43:36                   ^
04-Dec-2020 16:43:36 /opt/bamboo-home/xml-data/build-dir/REACTOR-RNEXT-JOB1/reactor-core/src/main/java9stubs/java/lang/StackWalker.java:17: warning: CallerSensitive is internal proprietary API and may be removed in a future release
04-Dec-2020 16:43:36         @CallerSensitive
04-Dec-2020 16:43:36          ^
04-Dec-2020 16:43:36 2 warnings
04-Dec-2020 16:43:36
04-Dec-2020 16:43:36 > Task :reactor-core:processJava9stubsResources NO-SOURCE
04-Dec-2020 16:43:36 > Task :reactor-core:java9stubsClasses
04-Dec-2020 16:43:48 > Task :reactor-core:compileKotlin
04-Dec-2020 16:43:50 /opt/bamboo-home/xml-data/build-dir/REACTOR-RNEXT-JOB1/reactor-core/src/main/java/reactor/core/publisher/Traces.java:41: warning: JavaLangAccess is internal proprietary API and may be removed in a future release
04-Dec-2020 16:43:50 import sun.misc.JavaLangAccess;
04-Dec-2020 16:43:50                ^
04-Dec-2020 16:43:50 /opt/bamboo-home/xml-data/build-dir/REACTOR-RNEXT-JOB1/reactor-core/src/main/java/reactor/core/publisher/Traces.java:42: warning: SharedSecrets is internal proprietary API and may be removed in a future release
04-Dec-2020 16:43:50 import sun.misc.SharedSecrets;
04-Dec-2020 16:43:50                ^
04-Dec-2020 16:43:50
04-Dec-2020 16:43:50 > Task :reactor-core:compileJava
04-Dec-2020 16:43:54 /opt/bamboo-home/xml-data/build-dir/REACTOR-RNEXT-JOB1/reactor-core/src/main/java/reactor/core/publisher/Traces.java:194: warning: JavaLangAccess is internal proprietary API and may be removed in a future release
04-Dec-2020 16:43:54                         static final JavaLangAccess javaLangAccess = SharedSecrets.getJavaLangAccess();
04-Dec-2020 16:43:54                                      ^
04-Dec-2020 16:43:54 /opt/bamboo-home/xml-data/build-dir/REACTOR-RNEXT-JOB1/reactor-core/src/main/java/reactor/core/publisher/Traces.java:194: warning: SharedSecrets is internal proprietary API and may be removed in a future release
04-Dec-2020 16:43:54                         static final JavaLangAccess javaLangAccess = SharedSecrets.getJavaLangAccess();
04-Dec-2020 16:43:54                                                                      ^
04-Dec-2020 16:43:55 4 warnings
04-Dec-2020 16:43:56
04-Dec-2020 16:43:56 > Task :reactor-core:processResources
04-Dec-2020 16:43:56 > Task :reactor-core:classes
04-Dec-2020 16:43:56 > Task :reactor-core:inspectClassesForKotlinIC
04-Dec-2020 16:43:59 > Task :reactor-core:jar
04-Dec-2020 16:44:01 > Task :reactor-test:compileKotlin
04-Dec-2020 16:44:02 > Task :reactor-test:compileJava
04-Dec-2020 16:44:02 > Task :reactor-test:processResources NO-SOURCE
04-Dec-2020 16:44:02 > Task :reactor-test:classes
04-Dec-2020 16:44:02 > Task :reactor-test:inspectClassesForKotlinIC
04-Dec-2020 16:44:02 > Task :reactor-test:jar
04-Dec-2020 16:44:07 > Task :reactor-core:compileTestKotlin
04-Dec-2020 16:44:33 > Task :reactor-core:compileTestJava
04-Dec-2020 16:44:33 > Task :reactor-core:processTestResources
04-Dec-2020 16:44:33 > Task :reactor-core:testClasses
04-Dec-2020 16:44:37
04-Dec-2020 16:44:37 > Task :reactor-core:test
04-Dec-2020 16:44:37 Test class reactor.core.ExceptionsTest
04-Dec-2020 16:44:38 Test class reactor.core.scheduler.SchedulersTest
04-Dec-2020 16:44:51 Test class reactor.core.scheduler.SingleWorkerSchedulerTest
04-Dec-2020 16:44:52 Test class reactor.core.scheduler.BoundedElasticSchedulerTest
04-Dec-2020 16:45:04 Test class reactor.core.scheduler.InstantPeriodicWorkerTaskTest
04-Dec-2020 16:45:04 Test class reactor.core.scheduler.ExecutorSchedulerTrampolineTest
04-Dec-2020 16:45:05 Test class reactor.core.scheduler.WorkerTaskTest
04-Dec-2020 16:45:05 Test class reactor.core.scheduler.ImmediateSchedulerTest
04-Dec-2020 16:45:05 Test class reactor.core.scheduler.ElasticSchedulerTest
04-Dec-2020 16:45:12 Test class reactor.core.scheduler.SingleWorkerAroundTimerSchedulerTest
04-Dec-2020 16:45:12 Test class reactor.core.scheduler.TimedSchedulerTest
04-Dec-2020 16:45:12 Test class reactor.core.scheduler.ExecutorSchedulerTest
04-Dec-2020 16:45:12 Test class reactor.core.scheduler.ParallelSchedulerTest
04-Dec-2020 16:45:14 Test class reactor.core.scheduler.SchedulersHooksTest
04-Dec-2020 16:45:24 Test class reactor.core.scheduler.SingleSchedulerTest
04-Dec-2020 16:45:28 Test class reactor.core.scheduler.RejectedExecutionTest
04-Dec-2020 16:45:28 Test class reactor.core.scheduler.DelegateServiceSchedulerTest
04-Dec-2020 16:45:30 Test class reactor.core.DisposablesTest
04-Dec-2020 16:45:30 Test class reactor.core.ScannableTest
04-Dec-2020 16:45:33 Test class reactor.core.CurrentContextArchTest
04-Dec-2020 16:45:33 Test class reactor.core.CoreTest
04-Dec-2020 16:45:33 Test class reactor.core.ListCompositeDisposableTest
04-Dec-2020 16:45:34 Test class reactor.core.QueueSubscriptionTest
04-Dec-2020 16:45:34 Test class reactor.core.publisher.MonoSequenceEqualTest
04-Dec-2020 16:45:34 Test class reactor.core.publisher.OnNextFailureStrategyTest
04-Dec-2020 16:45:34 Test class reactor.core.publisher.FluxSkipWhileTest
04-Dec-2020 16:45:34 Test class reactor.core.publisher.MonoIgnorePublisherTest
04-Dec-2020 16:45:34 Test class reactor.core.publisher.FluxUsingTest
04-Dec-2020 16:45:35 Test class reactor.core.publisher.FluxFilterFuseableTest
04-Dec-2020 16:45:35 Test class reactor.core.publisher.FluxDematerializeTest
04-Dec-2020 16:45:35 Test class reactor.core.publisher.FluxOnBackpressureBufferTimeoutTest
04-Dec-2020 16:45:36 Test class reactor.core.publisher.MonoDelaySubscriptionTest
04-Dec-2020 16:45:36 Test class reactor.core.publisher.MonoSupplierTest
04-Dec-2020 16:45:36 Test class reactor.core.publisher.FluxDeferTest
04-Dec-2020 16:45:36 Test class reactor.core.publisher.FluxNeverTest
04-Dec-2020 16:45:36 Test class reactor.core.publisher.MonoRepeatWhenEmptyTest
04-Dec-2020 16:45:36 Test class reactor.core.publisher.FluxZipIterableTest
04-Dec-2020 16:45:36 Test class reactor.core.publisher.InternalOneSinkTest
04-Dec-2020 16:45:36 Test class reactor.core.publisher.FluxTakeUntilPredicateTest
04-Dec-2020 16:45:36 Test class reactor.core.publisher.FluxMergeSequentialTest
04-Dec-2020 16:45:37 Test class reactor.core.publisher.FluxLogTest
04-Dec-2020 16:45:37 Test class reactor.core.publisher.MonoUsingWhenTest
04-Dec-2020 16:45:38 Test class reactor.core.publisher.MonoHasElementsTest
04-Dec-2020 16:45:38 Test class reactor.core.publisher.FluxDelaySubscriptionTest
04-Dec-2020 16:45:38 Test class reactor.core.publisher.MonoFilterWhenTest
04-Dec-2020 16:45:38 Test class reactor.core.publisher.MonoIgnoreElementTest
04-Dec-2020 16:45:38 Test class reactor.core.publisher.MonoFilterTest
04-Dec-2020 16:45:38 Test class reactor.core.publisher.FluxBufferTest
04-Dec-2020 16:45:38 Test class reactor.core.publisher.InternalManySinkTest
04-Dec-2020 16:45:38 Test class reactor.core.publisher.FluxWindowTest
04-Dec-2020 16:45:38 Test class reactor.core.publisher.MonoIgnoreEmptyTest
04-Dec-2020 16:45:38 Test class reactor.core.publisher.BlockingIterableTest
04-Dec-2020 16:45:39 Test class reactor.core.publisher.MonoRetryTest
04-Dec-2020 16:45:39 Test class reactor.core.publisher.FluxErrorOnRequestTest
04-Dec-2020 16:45:39 Test class reactor.core.publisher.MonoSubscribeOnCallableTest
04-Dec-2020 16:45:39 Test class reactor.core.publisher.FluxWindowWhenTest
04-Dec-2020 16:45:48 Test class reactor.core.publisher.MonoFlatMapTest
04-Dec-2020 16:45:48 Test class reactor.core.publisher.FluxDoFirstTest
04-Dec-2020 16:45:48 Test class reactor.core.publisher.ParallelGroupTest
04-Dec-2020 16:45:48 Test class reactor.core.publisher.SinkManyBestEffortTest
04-Dec-2020 16:45:48 Test class reactor.core.publisher.SinkManyBestEffortTest$AllOrNothingSpecific
04-Dec-2020 16:45:49 Test class reactor.core.publisher.SinkManyBestEffortTest$BestEffortSpecific
04-Dec-2020 16:45:49 Test class reactor.core.publisher.FluxWithLatestFromTest
04-Dec-2020 16:45:49 Test class reactor.core.publisher.FluxIntervalTest
04-Dec-2020 16:45:49 Test class reactor.core.publisher.MonoDoOnEachTest
04-Dec-2020 16:45:49 Test class reactor.core.publisher.ParallelMergeSequentialTest
04-Dec-2020 16:45:49 Test class reactor.core.publisher.ParallelMapTest
04-Dec-2020 16:45:49 Test class reactor.core.publisher.MonoNextTest
04-Dec-2020 16:45:49 Test class reactor.core.publisher.ParallelLogTest
04-Dec-2020 16:45:50 Test class reactor.core.publisher.FluxSubscribeOnTest
04-Dec-2020 16:45:55 Test class reactor.core.publisher.FluxRefCountGraceTest
04-Dec-2020 16:45:57 Test class reactor.core.publisher.FluxErrorTest
04-Dec-2020 16:45:57 Test class reactor.core.publisher.SinkEmptyMulticastTest
04-Dec-2020 16:45:57 Test class reactor.core.publisher.FluxSourceTest
04-Dec-2020 16:45:57 Test class reactor.core.publisher.MonoRetryWhenTest
04-Dec-2020 16:45:58 Test class reactor.core.publisher.FluxRangeTest
04-Dec-2020 16:45:58 Test class reactor.core.publisher.EmitterProcessorTest
04-Dec-2020 16:45:59 Test class reactor.core.publisher.FluxPeekFuseableTest
04-Dec-2020 16:46:02 Test class reactor.core.publisher.FluxSubscribeOnValueTest
04-Dec-2020 16:46:02 Test class reactor.core.publisher.MonoPublishMulticastTest
04-Dec-2020 16:46:02 Test class reactor.core.publisher.MonoTimedTest
04-Dec-2020 16:46:02 Test class reactor.core.publisher.MonoHideTest
04-Dec-2020 16:46:02 Test class reactor.core.publisher.FluxExpandTest
04-Dec-2020 16:46:02 Test class reactor.core.publisher.FluxHideTest
04-Dec-2020 16:46:02 Test class reactor.core.publisher.ParallelFluxHideTest
04-Dec-2020 16:46:02 Test class reactor.core.publisher.ContextTests
04-Dec-2020 16:46:02 Test class reactor.core.publisher.MonoNameFuseableTest
04-Dec-2020 16:46:02 Test class reactor.core.publisher.FluxRefCountTest
04-Dec-2020 16:46:03 Test class reactor.core.publisher.InnerProducerTest
04-Dec-2020 16:46:03 Test class reactor.core.publisher.MonoCollectTest
04-Dec-2020 16:46:05 Test class reactor.core.publisher.MonoDelayTest
04-Dec-2020 16:46:06 Test class reactor.core.publisher.MonoDefaultIfEmptyTest
04-Dec-2020 16:46:06 Test class reactor.core.publisher.LambdaSubscriberTest
04-Dec-2020 16:46:06 Test class reactor.core.publisher.FluxJustTest
04-Dec-2020 16:46:06 Test class reactor.core.publisher.FluxTimeoutTest
04-Dec-2020 16:46:06 Test class reactor.core.publisher.FluxHandleTest
04-Dec-2020 16:46:06 Test class reactor.core.publisher.FluxBufferPredicateTest
04-Dec-2020 16:46:13 Test class reactor.core.publisher.MonoFirstWithSignalTest
04-Dec-2020 16:46:13 Test class reactor.core.publisher.FluxAutoConnectTest
04-Dec-2020 16:46:13 Test class reactor.core.publisher.FluxNameFuseableTest
04-Dec-2020 16:46:13 Test class reactor.core.publisher.FluxPublishMulticastTest
04-Dec-2020 16:46:13 Test class reactor.core.publisher.FluxWindowPredicateTest
04-Dec-2020 16:46:15 Test class reactor.core.publisher.FluxDelayUntilTest
04-Dec-2020 16:46:15 Test class reactor.core.publisher.MonoPeekAfterTest
04-Dec-2020 16:46:16 Test class reactor.core.publisher.MonoDoFirstTest
04-Dec-2020 16:46:16 Test class reactor.core.publisher.SignalLoggerTests
04-Dec-2020 16:46:16 Test class reactor.core.publisher.MonoToCompletableFutureTest
04-Dec-2020 16:46:16 Test class reactor.core.publisher.MonoWhenTest
04-Dec-2020 16:46:16 Test class reactor.core.publisher.MonoFromPublisherTest
04-Dec-2020 16:46:16 Test class reactor.core.publisher.FluxRepeatTest
04-Dec-2020 16:46:17 Test class reactor.core.publisher.FluxSwitchOnNextTest
04-Dec-2020 16:46:17 Test class reactor.core.publisher.ParallelMergeOrderedTest
04-Dec-2020 16:46:17 Test class reactor.core.publisher.ParallelSourceTest
04-Dec-2020 16:46:17 Test class reactor.core.publisher.FluxSwitchMapTest
04-Dec-2020 16:46:17 Test class reactor.core.publisher.FluxReplayTest
04-Dec-2020 16:46:17 Test class reactor.core.publisher.ParallelCollectTest
04-Dec-2020 16:46:17 Test class reactor.core.publisher.FluxFlatMapTest
04-Dec-2020 16:46:19 Test class reactor.core.publisher.BlockingOptionalMonoSubscriberTest
04-Dec-2020 16:46:19 Test class reactor.core.publisher.FluxConcatMapTest
04-Dec-2020 16:46:20 Test class reactor.core.publisher.MonoSingleTest
04-Dec-2020 16:46:20 Test class reactor.core.publisher.FluxFirstWithSignalOrTest
04-Dec-2020 16:46:21 Test class reactor.core.publisher.FluxArrayTest
04-Dec-2020 16:46:21 Test class reactor.core.publisher.MonoDoFinallyTest
04-Dec-2020 16:46:21 Test class reactor.core.publisher.MonoSubscriberTest
04-Dec-2020 16:46:21 Test class reactor.core.publisher.MonoCurrentContextTest
04-Dec-2020 16:46:21 Test class reactor.core.publisher.MonoMaterializeTest
04-Dec-2020 16:46:21 Test class reactor.core.publisher.SignalTest
04-Dec-2020 16:46:21 Test class reactor.core.publisher.ParallelFlatMapTest
04-Dec-2020 16:46:21 Test class reactor.core.publisher.MonoFlattenIterableTest
04-Dec-2020 16:46:21 Test class reactor.core.publisher.MonoSubscribeOnTest
04-Dec-2020 16:46:24 Test class reactor.core.publisher.FluxCastTest
04-Dec-2020 16:46:24 Test class reactor.core.publisher.DelegateProcessorTest
04-Dec-2020 16:46:24 Test class reactor.core.publisher.FluxSubscribeOnCallableTest
04-Dec-2020 16:46:24 Test class reactor.core.publisher.FluxDistinctUntilChangedTest
04-Dec-2020 16:46:28 Test class reactor.core.publisher.FluxCallableTest
04-Dec-2020 16:46:28 Test class reactor.core.publisher.FluxMergeWithTest
04-Dec-2020 16:46:28 Test class reactor.core.publisher.UnicastManySinkNoBackpressureTest
04-Dec-2020 16:46:29 Test class reactor.core.publisher.MonoPeekTerminalTest
04-Dec-2020 16:46:29 Test class reactor.core.publisher.FluxCombineLatestTest
04-Dec-2020 16:46:29 Test class reactor.core.publisher.FluxOnErrorResumeTest
04-Dec-2020 16:46:29 Test class reactor.core.publisher.FluxConcatMapNoPrefetchTest
04-Dec-2020 16:46:30 Test class reactor.core.publisher.BaseSubscriberTest
04-Dec-2020 16:46:30 Test class reactor.core.publisher.MonoErrorTest
04-Dec-2020 16:46:30 Test class reactor.core.publisher.MonoRepeatPredicateTest
04-Dec-2020 16:46:30 Test class reactor.core.publisher.FluxTakeWhileTest
04-Dec-2020 16:46:30 Test class reactor.core.publisher.FluxBufferTimeoutTest
04-Dec-2020 16:46:30 Test class reactor.core.publisher.UnicastProcessorTest
04-Dec-2020 16:46:31 Test class reactor.core.publisher.MonoTimestampTest
04-Dec-2020 16:46:31 Test class reactor.core.publisher.MonoMapTest
04-Dec-2020 16:46:31 Test class reactor.core.publisher.FluxLimitRequestTest
04-Dec-2020 16:46:31 Test class reactor.core.publisher.FluxDetachTest
04-Dec-2020 16:46:33 Test class reactor.core.publisher.FluxMapTest
04-Dec-2020 16:46:33 Test class reactor.core.publisher.FluxFilterWhenTest
04-Dec-2020 16:46:33 Test class reactor.core.publisher.FluxErrorSuppliedTest
04-Dec-2020 16:46:33 Test class reactor.core.publisher.TailCallSubscribeTest
04-Dec-2020 16:46:33 Test class reactor.core.publisher.MonoCacheTimeTest
04-Dec-2020 16:46:36 Test class reactor.core.publisher.ParallelConcatMapTest
04-Dec-2020 16:46:36 Test class reactor.core.publisher.FluxGenerateTest
04-Dec-2020 16:46:36 Test class reactor.core.publisher.FluxIterableTest
04-Dec-2020 16:46:37 Test class reactor.core.publisher.MonoCountTest
04-Dec-2020 16:46:37 Test class reactor.core.publisher.MonoCallableOnAssemblyTest
04-Dec-2020 16:46:37 Test class reactor.core.publisher.MonoSourceTest
04-Dec-2020 16:46:37 Test class reactor.core.publisher.FluxScanSeedTest
04-Dec-2020 16:46:37 Test class reactor.core.publisher.MonoNameTest
04-Dec-2020 16:46:37 Test class reactor.core.publisher.FluxRepeatPredicateTest
04-Dec-2020 16:46:37 Test class reactor.core.publisher.FluxFlattenIterableTest
04-Dec-2020 16:46:39 Test class reactor.core.publisher.ParallelPeekTest
04-Dec-2020 16:46:39 Test class reactor.core.publisher.FluxRetryTest
04-Dec-2020 16:46:39 Test class reactor.core.publisher.FluxSkipUntilTest
04-Dec-2020 16:46:39 Test class reactor.core.publisher.ParallelArraySourceTest
04-Dec-2020 16:46:39 Test class reactor.core.publisher.FluxMergeOrderedTest
04-Dec-2020 16:46:40 Test class reactor.core.publisher.ParallelThenTest
04-Dec-2020 16:46:40 Test class reactor.core.publisher.FluxFirstWithSignalTest
04-Dec-2020 16:46:40 Test class reactor.core.publisher.ParallelFluxNameTest
04-Dec-2020 16:46:40 Test class reactor.core.publisher.FluxZipTest
04-Dec-2020 16:46:40 Test class reactor.core.publisher.MonoElementAtTest
04-Dec-2020 16:46:40 Test class reactor.core.publisher.MonoDeferComposeTest
04-Dec-2020 16:46:40 Test class reactor.core.publisher.MonoThenIgnoreTest
04-Dec-2020 16:46:40 Test class reactor.core.publisher.MonoReduceSeedTest
04-Dec-2020 16:46:41 Test class reactor.core.publisher.StrictSubscriberTest
04-Dec-2020 16:46:41 Test class reactor.core.publisher.SinkManySerializedTest
04-Dec-2020 16:46:41 Test class reactor.core.publisher.MonoPeekTest
04-Dec-2020 16:46:41 Test class reactor.core.publisher.FluxDoFinallyTest
04-Dec-2020 16:46:41 Test class reactor.core.publisher.SerializedSubscriberTest
04-Dec-2020 16:46:42 Test class reactor.core.publisher.FluxConcatArrayTest
04-Dec-2020 16:46:42 Test class reactor.core.publisher.MonoSwitchIfEmptyTest
04-Dec-2020 16:46:42 Test class reactor.core.publisher.MonoDetachTest
04-Dec-2020 16:46:44 Test class reactor.core.publisher.FluxPublishOnTest
04-Dec-2020 16:46:53 Test class reactor.core.publisher.FluxCreateTest
04-Dec-2020 16:46:54 Test class reactor.core.publisher.BlockingSingleSubscriberTest
04-Dec-2020 16:46:54 Test class reactor.core.publisher.FluxRepeatWhenTest
04-Dec-2020 16:46:54 Test class reactor.core.publisher.MonoOnErrorResumeTest
04-Dec-2020 16:46:54 Test class reactor.core.publisher.MonoTimeoutTest
04-Dec-2020 16:46:54 Test class reactor.core.publisher.SinksTest
04-Dec-2020 16:46:54 Test class reactor.core.publisher.SinksTest$SingleOrEmpty
04-Dec-2020 16:46:55 Test class reactor.core.publisher.SinksTest$Unicast
04-Dec-2020 16:46:56 Test class reactor.core.publisher.SinksTest$MulticastDirectAllOrNothing
04-Dec-2020 16:46:57 Test class reactor.core.publisher.SinksTest$MulticastDirectBestEffort
04-Dec-2020 16:46:58 Test class reactor.core.publisher.SinksTest$MulticastReplayDuration
04-Dec-2020 16:46:58 Test class reactor.core.publisher.SinksTest$MulticastReplayN
04-Dec-2020 16:47:01 Test class reactor.core.publisher.SinksTest$MulticastReplayAll
04-Dec-2020 16:47:03 Test class reactor.core.publisher.SinksTest$Multicast
04-Dec-2020 16:47:05 Test class reactor.core.publisher.FluxConcatWithTest
04-Dec-2020 16:47:05 Test class reactor.core.publisher.FluxNameTest
04-Dec-2020 16:47:05 Test class reactor.core.publisher.FluxJoinTest
04-Dec-2020 16:47:05 Test class reactor.core.publisher.FluxProcessorTest
04-Dec-2020 16:47:06 Test class reactor.core.publisher.MonoContextWriteTest
04-Dec-2020 16:47:06 Test class reactor.core.publisher.MonoExpandTest
04-Dec-2020 16:47:06 Test class reactor.core.publisher.FluxAutoConnectFuseableTest
04-Dec-2020 16:47:06 Test class reactor.core.publisher.FluxIndexTest
04-Dec-2020 16:47:07 Test class reactor.core.publisher.ParallelFluxTest
04-Dec-2020 16:47:59 Test class reactor.core.publisher.OperatorDisposablesTest
04-Dec-2020 16:47:59 Test class reactor.core.publisher.MonoStreamCollectorTest
04-Dec-2020 16:47:59 Test class reactor.core.publisher.MonoSubscribeOnValueTest
04-Dec-2020 16:47:59 Test class reactor.core.publisher.MonoJustTest
04-Dec-2020 16:47:59 Test class reactor.core.publisher.MonoErrorSuppliedTest
04-Dec-2020 16:47:59 Test class reactor.core.publisher.OnDiscardShouldNotLeakTest
04-Dec-2020 16:51:22 Test class reactor.core.publisher.FluxDeferComposeTest
04-Dec-2020 16:51:22 Test class reactor.core.publisher.FluxSwitchIfEmptyTest
04-Dec-2020 16:51:22 Test class reactor.core.publisher.FluxTakeTest
04-Dec-2020 16:51:31 Test class reactor.core.publisher.MonoCollectListTest
04-Dec-2020 16:51:33 Test class reactor.core.publisher.FluxSkipLastTest
04-Dec-2020 16:51:34 Test class reactor.core.publisher.FluxEmptyTest
04-Dec-2020 16:51:34 Test class reactor.core.publisher.MonoIgnoreThenTest
04-Dec-2020 16:51:34 Test class reactor.core.publisher.FluxBufferBoundaryTest
04-Dec-2020 16:51:34 Test class reactor.core.publisher.FluxTakeLastTest
04-Dec-2020 16:51:34 Test class reactor.core.publisher.FluxSourceMonoTest
04-Dec-2020 16:51:34 Test class reactor.core.publisher.FluxMaterializeTest
04-Dec-2020 16:51:34 Test class reactor.core.publisher.MonoAllTest
04-Dec-2020 16:51:34 Test class reactor.core.publisher.MonoSourceFluxTest
04-Dec-2020 16:51:34 Test class reactor.core.publisher.FluxStreamTest
04-Dec-2020 16:51:34 Test class reactor.core.publisher.FluxFilterTest
04-Dec-2020 16:51:34 Test class reactor.core.publisher.FluxStartWithTest
04-Dec-2020 16:51:34 Test class reactor.core.publisher.FluxOnBackpressureDropTest
04-Dec-2020 16:51:34 Test class reactor.core.publisher.MonoHandleTest
04-Dec-2020 16:51:34 Test class reactor.core.publisher.FluxContextWriteTest
04-Dec-2020 16:51:34 Test class reactor.core.publisher.MonoPublishOnTest
04-Dec-2020 16:51:34 Test class reactor.core.publisher.scenarios.MonoTests
04-Dec-2020 16:51:36 Test class reactor.core.publisher.scenarios.PopularTagTests
04-Dec-2020 16:51:39 Test class reactor.core.publisher.scenarios.FluxTests
04-Dec-2020 16:51:58 Test class reactor.core.publisher.scenarios.FluxWindowConsistencyTest
04-Dec-2020 16:52:00 Test class reactor.core.publisher.scenarios.ScatterGatherTests
04-Dec-2020 16:52:01 Test class reactor.core.publisher.scenarios.FluxSpecTests
04-Dec-2020 16:52:01 Test class reactor.core.publisher.scenarios.FizzBuzzTests
04-Dec-2020 16:52:01 Test class reactor.core.publisher.FluxPublishTest
04-Dec-2020 16:52:01 Test class reactor.core.publisher.FluxSwitchOnFirstTest
04-Dec-2020 16:52:35 Test class reactor.core.publisher.FluxCacheTest
04-Dec-2020 16:52:35 Test class reactor.core.publisher.ParallelFilterTest
04-Dec-2020 16:52:35 Test class reactor.core.publisher.FluxFirstWithValueTest
04-Dec-2020 16:52:36 Test class reactor.core.publisher.MonoEmptyTest
04-Dec-2020 16:52:36 Test class reactor.core.publisher.MonoTakeUntilOtherTest
04-Dec-2020 16:52:36 Test class reactor.core.publisher.FluxOnAssemblyTest
04-Dec-2020 16:52:36 Test class reactor.core.publisher.MonoCancelOnTest
04-Dec-2020 16:52:36 Test class reactor.core.publisher.MonoZipTest
04-Dec-2020 16:52:38 Test class reactor.core.publisher.ParallelMergeReduceTest
04-Dec-2020 16:52:38 Test class reactor.core.publisher.MonoDematerializeTest
04-Dec-2020 16:52:39 Test class reactor.core.publisher.FluxMergeTest
04-Dec-2020 16:52:39 Test class reactor.core.publisher.ConnectableFluxOnAssemblyTest
04-Dec-2020 16:52:39 Test class reactor.core.publisher.ContextLossDetectionTest
04-Dec-2020 16:52:39 Test class reactor.core.publisher.ParallelLiftTest
04-Dec-2020 16:52:39 Test class reactor.core.publisher.FluxTimedTest
04-Dec-2020 16:52:39 Test class reactor.core.publisher.FluxSkipTest
04-Dec-2020 16:52:39 Test class reactor.core.publisher.FluxCancelOnTest
04-Dec-2020 16:52:39 Test class reactor.core.publisher.FluxThenManyTest
04-Dec-2020 16:52:39 Test class reactor.core.publisher.MonoCallableTest
04-Dec-2020 16:52:40 Test class reactor.core.publisher.FluxOnBackpressureBufferTest
04-Dec-2020 16:52:40 Test class reactor.core.publisher.FluxSampleTest
04-Dec-2020 16:52:41 Test class reactor.core.publisher.FluxGroupJoinTest
04-Dec-2020 16:52:41 Test class reactor.core.publisher.MonoRepeatTest
04-Dec-2020 16:52:41 Test class reactor.core.publisher.MonoCompletionStageTest
04-Dec-2020 16:52:51 Test class reactor.core.publisher.MonoTakeLastOneTest
04-Dec-2020 16:52:51 Test class reactor.core.publisher.ParallelRunOnTest
04-Dec-2020 16:52:52 Test class reactor.core.publisher.FluxDistinctTest
04-Dec-2020 16:52:57 Test class reactor.core.publisher.NextProcessorTest
04-Dec-2020 16:52:58 Test class reactor.core.publisher.FluxOnBackpressureBufferStrategyTest
04-Dec-2020 16:52:58 Test class reactor.core.publisher.FluxWindowBoundaryTest
04-Dec-2020 16:52:58 Test class reactor.core.publisher.FluxTakeUntilOtherTest
04-Dec-2020 16:52:58 Test class reactor.core.publisher.MonoLogTest
04-Dec-2020 16:52:58 Test class reactor.core.publisher.MonoDelayUntilTest
04-Dec-2020 16:52:59 Test class reactor.core.publisher.MonoCreateTest
04-Dec-2020 16:52:59 Test class reactor.core.publisher.FluxDoOnEachTest
04-Dec-2020 16:52:59 Test class reactor.core.publisher.FluxGroupByTest
04-Dec-2020 16:53:05 Test class reactor.core.publisher.FluxSampleTimeoutTest
04-Dec-2020 16:53:05 Test class reactor.core.publisher.FluxOnBackpressureLatestTest
04-Dec-2020 16:53:07 Test class reactor.core.publisher.MonoCastTest
04-Dec-2020 16:53:07 Test class reactor.core.publisher.ConnectableFluxHideTest
04-Dec-2020 16:53:07 Test class reactor.core.publisher.MonoRunnableTest
04-Dec-2020 16:53:09 Test class reactor.core.publisher.FluxSampleFirstTest
04-Dec-2020 16:53:09 Test class reactor.core.publisher.MonoOnAssemblyTest
04-Dec-2020 16:53:09 Test class reactor.core.publisher.FluxSkipUntilOtherTest
04-Dec-2020 16:53:09 Test class reactor.core.publisher.MonoDeferTest
04-Dec-2020 16:53:09 Test class reactor.core.publisher.ParallelReduceSeedTest
04-Dec-2020 16:53:10 Test class reactor.core.publisher.FluxWindowTimeoutTest
04-Dec-2020 16:53:10 Test class reactor.core.publisher.MonoFirstWithValueTest
04-Dec-2020 16:53:10 Test class reactor.core.publisher.MonoThenManyTest
04-Dec-2020 16:53:10 Test class reactor.core.publisher.MonoUsingTest
04-Dec-2020 16:53:11 Test class reactor.core.publisher.FluxTakeLastOneTest
04-Dec-2020 16:53:11 Test class reactor.core.publisher.FluxElapsedTest
04-Dec-2020 16:53:11 Test class reactor.core.publisher.MonoAnyTest
04-Dec-2020 16:53:11 Test class reactor.core.publisher.LambdaMonoSubscriberTest
04-Dec-2020 16:53:11 Test class reactor.core.publisher.FluxUsingWhenTest
04-Dec-2020 16:53:16 Test class reactor.core.publisher.FluxDefaultIfEmptyTest
04-Dec-2020 16:53:16 Test class reactor.core.publisher.OperatorsTest
04-Dec-2020 16:53:17 Test class reactor.core.publisher.MonoCollectMapTest
04-Dec-2020 16:53:17 Test class reactor.core.publisher.MonoDelayElementTest
04-Dec-2020 16:53:17 Test class reactor.core.publisher.ParallelFluxOnAssemblyTest
04-Dec-2020 16:53:17 Test class reactor.core.publisher.ParallelDoOnEachTest
04-Dec-2020 16:53:17 Test class reactor.core.publisher.MonoElapsedTest
04-Dec-2020 16:53:17 Test class reactor.core.publisher.FluxConcatIterableTest
04-Dec-2020 16:53:17 Test class reactor.core.publisher.MonoSingleMonoTest
04-Dec-2020 16:53:17 Test class reactor.core.publisher.TracesTest
04-Dec-2020 16:53:17 Test class reactor.core.publisher.FluxDelaySequenceTest
04-Dec-2020 16:53:17 Test class reactor.core.publisher.MonoIgnoreElementsTest
04-Dec-2020 16:53:17 Test class reactor.core.publisher.BlockingTests
04-Dec-2020 16:53:19 Test class reactor.core.publisher.HooksTest
04-Dec-2020 16:53:19 Test class reactor.core.publisher.QueueDrainSubscriberTest
04-Dec-2020 16:53:19 Test class reactor.core.publisher.FluxRetryWhenTest
04-Dec-2020 16:53:20 Test class reactor.core.publisher.MonoNeverTest
04-Dec-2020 16:53:20 Test class reactor.core.publisher.FluxCallableOnAssemblyTest
04-Dec-2020 16:53:20 Test class reactor.core.publisher.FluxDeferContextualTest
04-Dec-2020 16:53:20 Test class reactor.core.publisher.FluxPeekTest
04-Dec-2020 16:53:23 Test class reactor.core.publisher.MonoFlatMapManyTest
04-Dec-2020 16:53:23 Test class reactor.core.publisher.ParallelMergeSortTest
04-Dec-2020 16:53:23 Test class reactor.core.publisher.LiftFunctionTest$GroupedLiftFuseableTest
04-Dec-2020 16:53:23 Test class reactor.core.publisher.LiftFunctionTest$ConnectableLiftFuseableTest$WithCancelSupport
04-Dec-2020 16:53:23 Test class reactor.core.publisher.LiftFunctionTest$ConnectableLiftFuseableTest$Normal
04-Dec-2020 16:53:23 Test class reactor.core.publisher.LiftFunctionTest$ParallelLiftFuseableTest
04-Dec-2020 16:53:23 Test class reactor.core.publisher.LiftFunctionTest$FluxLiftFuseableTest
04-Dec-2020 16:53:23 Test class reactor.core.publisher.LiftFunctionTest$MonoLiftFuseableTest
04-Dec-2020 16:53:23 Test class reactor.core.publisher.LiftFunctionTest$GroupedLiftTest
04-Dec-2020 16:53:23 Test class reactor.core.publisher.LiftFunctionTest$ConnectableLiftTest$WithCancelSupport
04-Dec-2020 16:53:23 Test class reactor.core.publisher.LiftFunctionTest$ConnectableLiftTest$Normal
04-Dec-2020 16:53:23 Test class reactor.core.publisher.LiftFunctionTest$ParallelLiftTest
04-Dec-2020 16:53:23 Test class reactor.core.publisher.LiftFunctionTest$FluxLiftTest
04-Dec-2020 16:53:23 Test class reactor.core.publisher.LiftFunctionTest$MonoLiftTest
04-Dec-2020 16:53:23 Test class reactor.core.publisher.MonoReduceTest
04-Dec-2020 16:53:25 Test class reactor.core.publisher.FluxBufferWhenTest
04-Dec-2020 16:53:46 Test class reactor.core.publisher.FluxIndexedFuseableTest
04-Dec-2020 16:53:47 Test class reactor.core.publisher.ReplayProcessorTest
04-Dec-2020 16:53:47 Test class reactor.core.publisher.FluxScanTest
04-Dec-2020 16:53:47 Test class reactor.core.publisher.FluxMapSignalTest
04-Dec-2020 16:53:47 Test class reactor.core.publisher.FluxTimestampTest
04-Dec-2020 16:53:47 Test class reactor.core.publisher.DirectProcessorTest
04-Dec-2020 16:53:48 Test class reactor.core.SwapDisposableTest
04-Dec-2020 16:53:48 Test class reactor.core.DisposableTest
04-Dec-2020 16:53:48 Test class reactor.guide.GuideDebuggingExtraTests
04-Dec-2020 16:53:48 Test class reactor.guide.GuideTests
04-Dec-2020 16:53:51 Test class reactor.HooksTraceTest
04-Dec-2020 16:53:51 Test class reactor.util.function.TupleTests
04-Dec-2020 16:53:51 Test class reactor.util.function.Tuple8Test
04-Dec-2020 16:53:51 Test class reactor.util.function.Tuple2Test
04-Dec-2020 16:53:51 Test class reactor.util.function.Tuple7Test
04-Dec-2020 16:53:51 Test class reactor.util.function.Tuple6Test
04-Dec-2020 16:53:51 Test class reactor.util.function.Tuple3Test
04-Dec-2020 16:53:51 Test class reactor.util.function.Tuple4Test
04-Dec-2020 16:53:51 Test class reactor.util.function.Tuple5Test
04-Dec-2020 16:53:51 Test class reactor.util.MetricsNoMicrometerTest
04-Dec-2020 16:53:51 Test class reactor.util.LoggersTest
04-Dec-2020 16:53:51 Test class reactor.util.context.Context3Test
04-Dec-2020 16:53:51 Test class reactor.util.context.Context2Test
04-Dec-2020 16:53:51 Test class reactor.util.context.ContextViewTest
04-Dec-2020 16:53:51 Test class reactor.util.context.CoreContextTest
04-Dec-2020 16:53:51 Test class reactor.util.context.ContextTest
04-Dec-2020 16:53:51 Test class reactor.util.context.Context0Test
04-Dec-2020 16:53:51 Test class reactor.util.context.Context4Test
04-Dec-2020 16:53:51 Test class reactor.util.context.ContextNTest
04-Dec-2020 16:53:51 Test class reactor.util.context.Context5Test
04-Dec-2020 16:53:51 Test class reactor.util.context.Context1Test
04-Dec-2020 16:53:51 Test class reactor.util.retry.RetrySpecTest
04-Dec-2020 16:53:53 Test class reactor.util.retry.RetryBackoffSpecTest
04-Dec-2020 16:53:56 Test class reactor.util.concurrent.QueuesTest
04-Dec-2020 16:53:56 Test class reactor.util.concurrent.MpscLinkedQueueTest
04-Dec-2020 16:53:56 Test class reactor.util.concurrent.QueuesOneQueueTest
04-Dec-2020 16:53:56 Test class reactor.util.concurrent.SpscArrayQueueTest
04-Dec-2020 16:53:56 Test class reactor.util.ConsoleLoggerTest
04-Dec-2020 16:53:56 Test class reactor.util.JdkLoggerTest
04-Dec-2020 16:53:56 Test class reactor.core.publisher.MonoExtensionsTests
04-Dec-2020 16:53:57 Test class reactor.core.publisher.FluxExtensionsTests
04-Dec-2020 16:53:57 Test class reactor.core.publisher.MonoFunctionsTests
04-Dec-2020 16:53:57 Test class reactor.util.function.TupleDestructuringTests
04-Dec-2020 16:53:57
04-Dec-2020 16:53:57 Gradle Test Run :reactor-core:test Results: SUCCESS (7291 tests, 7197 successes, 0 failures, 94 skipped)
04-Dec-2020 16:54:01
04-Dec-2020 16:54:01 > Task :reactor-core:jacocoTestReport
04-Dec-2020 16:54:02
04-Dec-2020 16:54:02 > Task :reactor-core:downloadBaseline
04-Dec-2020 16:54:02 Download https://jcenter.bintray.com/io/projectreactor/reactor-core/3.4.0/reactor-core-3.4.0.jar
04-Dec-2020 16:54:02
04-Dec-2020 16:54:02 > Task :reactor-core:compileJcstressKotlin
04-Dec-2020 16:54:03 > Task :reactor-core:compileJcstressJava
04-Dec-2020 16:54:03 > Task :reactor-core:processJcstressResources NO-SOURCE
04-Dec-2020 16:54:03 > Task :reactor-core:jcstressClasses
04-Dec-2020 16:54:03 > Task :reactor-core:jcstressJar
04-Dec-2020 16:54:05 > Task :reactor-core:japicmp
04-Dec-2020 16:54:05
04-Dec-2020 16:54:05 > Task :reactor-core:jcstress
04-Dec-2020 16:54:05 Java Concurrency Stress Tests
04-Dec-2020 16:54:05 ---------------------------------------------------------------------------------
04-Dec-2020 16:54:05 Rev: a0cc333318f0a3e5, built by shade with 11.0.8-testing at 2020-10-14T09:49:41Z
04-Dec-2020 16:54:05
04-Dec-2020 16:54:05 Burning up to figure out the exact CPU count....... done!
04-Dec-2020 16:54:05
04-Dec-2020 16:54:05 Probing the target OS:
04-Dec-2020 16:54:05 (all failures are non-fatal, but may affect testing accuracy)
04-Dec-2020 16:54:05
04-Dec-2020 16:54:05 ----- [OK] Trying to set affinity with taskset
04-Dec-2020 16:54:05
04-Dec-2020 16:54:05 Initializing and probing the target VM:
04-Dec-2020 16:54:05 (all failures are non-fatal, but may affect testing accuracy)
04-Dec-2020 16:54:05
04-Dec-2020 16:54:05 ----- [OK] Unlocking diagnostic VM options
04-Dec-2020 16:54:05 ----- [OK] Trimming down the default VM heap size to 1/4-th of max RAM
04-Dec-2020 16:54:05 ----- [OK] Trimming down the number of compiler threads
04-Dec-2020 16:54:05 ----- [OK] Trimming down the number of parallel GC threads
04-Dec-2020 16:54:05 ----- [OK] Trimming down the number of concurrent GC threads
04-Dec-2020 16:54:05 ----- [OK] Trimming down the number of G1 concurrent refinement GC threads
04-Dec-2020 16:54:06 ----- [OK] Testing @Contended works on all results and infra objects
04-Dec-2020 16:54:06 ----- [OK] Unlocking Whitebox API for online de-optimization: all methods
04-Dec-2020 16:54:06 ----- [OK] Unlocking Whitebox API for online de-optimization: selected methods
04-Dec-2020 16:54:06 ----- [FAILED] Unlocking C2 local code motion randomizer
04-Dec-2020 16:54:06 Error: VM option 'StressLCM' is develop and is available only in debug version of VM.
04-Dec-2020 16:54:06 Error: Could not create the Java Virtual Machine.
04-Dec-2020 16:54:06 Error: A fatal exception has occurred. Program will exit.
04-Dec-2020 16:54:06
04-Dec-2020 16:54:06 ----- [FAILED] Unlocking C2 global code motion randomizer
04-Dec-2020 16:54:06 Error: VM option 'StressGCM' is develop and is available only in debug version of VM.
04-Dec-2020 16:54:06 Error: Could not create the Java Virtual Machine.
04-Dec-2020 16:54:06 Error: A fatal exception has occurred. Program will exit.
04-Dec-2020 16:54:06
04-Dec-2020 16:54:06 ----- [FAILED] Unlocking C2 iterative global value numbering randomizer
04-Dec-2020 16:54:06 Unrecognized VM option 'StressIGVN'
04-Dec-2020 16:54:06 Error: Could not create the Java Virtual Machine.
04-Dec-2020 16:54:06 Error: A fatal exception has occurred. Program will exit.
04-Dec-2020 16:54:06
04-Dec-2020 16:54:06 ----- [OK] Testing allocation profiling
04-Dec-2020 16:54:06 ----- [FAILED] Trying Thread.onSpinWait
04-Dec-2020 16:54:06 Exception in thread "main" java.lang.NoSuchMethodError: java.lang.Thread.onSpinWait()V
04-Dec-2020 16:54:06         at org.openjdk.jcstress.vm.ThreadSpinWaitTestMain.main(ThreadSpinWaitTestMain.java:30)
04-Dec-2020 16:54:06
04-Dec-2020 16:54:06
04-Dec-2020 16:54:06 Probing what VM modes are available:
04-Dec-2020 16:54:06 (failures are non-fatal, but may miss some interesting cases)
04-Dec-2020 16:54:06
04-Dec-2020 16:54:06 ----- [OK] [-Xint]
04-Dec-2020 16:54:06 ----- [OK] [-XX:TieredStopAtLevel=1]
04-Dec-2020 16:54:06 ----- [OK] [-XX:-TieredCompilation]
04-Dec-2020 16:54:06 ----- [OK] [-XX:-TieredCompilation]
04-Dec-2020 16:54:06
04-Dec-2020 16:54:06   Hardware CPUs in use: 4, using plain hard busywait.
04-Dec-2020 16:54:06   Test preset mode: "quick"
04-Dec-2020 16:54:06   Writing the test results to "jcstress-results-2020-12-04-16-54-04.bin.gz"
04-Dec-2020 16:54:06   Parsing results to "/opt/bamboo-home/xml-data/build-dir/REACTOR-RNEXT-JOB1/reactor-core/build/reports/jcstress/"
04-Dec-2020 16:54:06   Running each test matching ".*" for 1 forks, 5 iterations, 200 ms each
04-Dec-2020 16:54:06   Each JVM would execute at most 20 tests in the row.
04-Dec-2020 16:54:06   Solo stride size will be autobalanced within [10, 10000] elements, but taking no more than 100 Mb.
04-Dec-2020 16:54:06
04-Dec-2020 16:54:06   Attached the non-interactive output stream.
04-Dec-2020 16:54:06   Printing the progress line at least every 15000 milliseconds.
04-Dec-2020 16:54:06
04-Dec-2020 16:54:07 (ETA:   00:00:05) (Sample Rate: 14.28 M/sec) (Tests: 1 of 11) (Forks:  1 of 44) (Iterations:  1 of 264; 1 passed, 0 failed, 0 soft errs, 0 hard errs)
04-Dec-2020 16:54:22 (ETA:   00:00:50) (Sample Rate: 1650.96 K/sec) (Tests: 11 of 11) (Forks: 11 of 44) (Iterations: 61 of 264; 61 passed, 0 failed, 0 soft errs, 0 hard errs)
04-Dec-2020 16:54:40 (ETA:   00:01:08) (Sample Rate: 827.68 K/sec) (Tests: 11 of 11) (Forks: 15 of 44) (Iterations: 85 of 264; 85 passed, 0 failed, 0 soft errs, 0 hard errs)
04-Dec-2020 16:54:55 (ETA:   00:01:07) (Sample Rate: 606.60 K/sec) (Tests: 11 of 11) (Forks: 19 of 44) (Iterations: 109 of 264; 109 passed, 0 failed, 0 soft errs, 0 hard errs)
04-Dec-2020 16:55:10 (ETA:   00:00:48) (Sample Rate: 615.34 K/sec) (Tests: 11 of 11) (Forks: 24 of 44) (Iterations: 149 of 264; 149 passed, 0 failed, 0 soft errs, 0 hard errs)
04-Dec-2020 16:55:25 (ETA:   00:00:16) (Sample Rate: 945.66 K/sec) (Tests: 11 of 11) (Forks: 29 of 44) (Iterations: 217 of 264; 217 passed, 0 failed, 0 soft errs, 0 hard errs)
04-Dec-2020 16:55:40 (ETA:   00:00:00) (Sample Rate: 878.32 K/sec) (Tests: 11 of 11) (Forks: 33 of 44) (Iterations: 261 of 264; 261 passed, 0 failed, 0 soft errs, 0 hard errs)
04-Dec-2020 16:55:42
04-Dec-2020 16:55:42
04-Dec-2020 16:55:42 RUN COMPLETE.
04-Dec-2020 16:55:42
04-Dec-2020 16:55:42 RUN RESULTS:
04-Dec-2020 16:55:42 ------------------------------------------------------------------------------------------------------------------------
04-Dec-2020 16:55:42
04-Dec-2020 16:55:42 *** INTERESTING tests
04-Dec-2020 16:55:42   Some interesting behaviors observed. This is for the plain curiosity.
04-Dec-2020 16:55:42
04-Dec-2020 16:55:42   0 matching test results.
04-Dec-2020 16:55:42
04-Dec-2020 16:55:42 *** FAILED tests
04-Dec-2020 16:55:42   Strong asserts were violated. Correct implementations should have no assert failures here.
04-Dec-2020 16:55:42
04-Dec-2020 16:55:42   0 matching test results.
04-Dec-2020 16:55:42
04-Dec-2020 16:55:42 *** ERROR tests
04-Dec-2020 16:55:42   Tests break for some reason, other than failing the assert. Correct implementations should have none.
04-Dec-2020 16:55:42
04-Dec-2020 16:55:42   0 matching test results.
04-Dec-2020 16:55:42
04-Dec-2020 16:55:42 *** All remaining tests
04-Dec-2020 16:55:42   Tests that do not fall into any of the previous categories.
04-Dec-2020 16:55:42
04-Dec-2020 16:55:42   33 matching test results.  Use -v to print them.
04-Dec-2020 16:55:42
04-Dec-2020 16:55:42 ------------------------------------------------------------------------------------------------------------------------
04-Dec-2020 16:55:42
04-Dec-2020 16:55:42 HTML report was generated. Look at /opt/bamboo-home/xml-data/build-dir/REACTOR-RNEXT-JOB1/reactor-core/build/reports/jcstress/index.html for the complete run results.
04-Dec-2020 16:55:42
04-Dec-2020 16:55:42 Will throw any pending exceptions at this point.
04-Dec-2020 16:55:42 Done.
04-Dec-2020 16:55:44
04-Dec-2020 16:55:44 > Task :reactor-core:reactivestreamsTCK
04-Dec-2020 16:55:44 Additional tests from `reactivestreamsTCK` ([**/*Verification.*])
04-Dec-2020 16:55:44 Test suite 'Gradle test'
04-Dec-2020 16:56:43
04-Dec-2020 16:56:43 Gradle Test Run :reactor-core:reactivestreamsTCK Results: SUCCESS (182 tests, 135 successes, 0 failures, 47 skipped)
04-Dec-2020 16:56:43
04-Dec-2020 16:56:43 > Task :reactor-core:compileWithMicrometerTestKotlin
04-Dec-2020 16:56:45 > Task :reactor-core:compileWithMicrometerTestJava
04-Dec-2020 16:56:45 > Task :reactor-core:processWithMicrometerTestResources NO-SOURCE
04-Dec-2020 16:56:45 > Task :reactor-core:withMicrometerTestClasses
04-Dec-2020 16:56:48
04-Dec-2020 16:56:48 > Task :reactor-core:withMicrometerTest
04-Dec-2020 16:56:48 Test class reactor.core.scheduler.SchedulersMetricsTest
04-Dec-2020 16:56:52 Test class reactor.core.publisher.MonoMetricsFuseableTest
04-Dec-2020 16:56:54 Test class reactor.core.publisher.FluxMetricsFuseableTest
04-Dec-2020 16:56:55 Test class reactor.core.publisher.MonoMetricsTest
04-Dec-2020 16:56:55 Test class reactor.core.publisher.FluxMetricsTest
04-Dec-2020 16:56:56 Test class reactor.util.MetricsTest
04-Dec-2020 16:56:56
04-Dec-2020 16:56:56 Gradle Test Run :reactor-core:withMicrometerTest Results: SUCCESS (102 tests, 102 successes, 0 failures, 0 skipped)
04-Dec-2020 16:56:56
04-Dec-2020 16:56:56 > Task :reactor-core:check
04-Dec-2020 16:56:56
04-Dec-2020 16:56:56 > Task :reactor-test:downloadBaseline
04-Dec-2020 16:56:56 Download https://jcenter.bintray.com/io/projectreactor/reactor-test/3.4.0/reactor-test-3.4.0.jar
04-Dec-2020 16:56:56
04-Dec-2020 16:56:56 > Task :reactor-test:japicmp
04-Dec-2020 16:56:57 > Task :reactor-test:compileTestKotlin
04-Dec-2020 16:56:58 > Task :reactor-test:compileTestJava
04-Dec-2020 16:56:58 > Task :reactor-test:processTestResources
04-Dec-2020 16:56:58 > Task :reactor-test:testClasses
04-Dec-2020 16:57:00
04-Dec-2020 16:57:00 > Task :reactor-test:test
04-Dec-2020 16:57:00 Test class reactor.test.scheduler.VirtualTimeSchedulerTests
04-Dec-2020 16:57:01 Test class reactor.test.ValueFormattersTest
04-Dec-2020 16:57:01 Test class reactor.test.StepVerifierDefaultTimeoutTests
04-Dec-2020 16:57:02 Test class reactor.test.MessageFormatterTest
04-Dec-2020 16:57:02 Test class reactor.test.StepVerifierTests
04-Dec-2020 16:57:15 Test class reactor.test.DefaultStepVerifierBuilderTests
04-Dec-2020 16:57:15 Test class reactor.test.publisher.PublisherProbeTest
04-Dec-2020 16:57:15 Test class reactor.test.publisher.DefaultTestPublisherTests
04-Dec-2020 16:57:15 Test class reactor.test.publisher.ColdTestPublisherTests
04-Dec-2020 16:57:15 Test class reactor.test.DefaultContextExpectationsTest
04-Dec-2020 16:57:15 Test class reactor.test.StepVerifierOptionsTest
04-Dec-2020 16:57:15 Test class reactor.test.StepVerifierAssertionsTests
04-Dec-2020 16:57:17 Test class reactor.test.StepVerifierTimeoutTests
04-Dec-2020 16:57:17 Test class reactor.test.util.LoggerUtilsTest
04-Dec-2020 16:57:17 Test class reactor.test.StepVerifierExtensionsTests
04-Dec-2020 16:57:18
04-Dec-2020 16:57:18 Gradle Test Run :reactor-test:test Results: SUCCESS (452 tests, 451 successes, 0 failures, 1 skipped)
04-Dec-2020 16:57:18
04-Dec-2020 16:57:18 > Task :reactor-test:check
04-Dec-2020 16:57:19 > Task :reactor-tools:compileJava
04-Dec-2020 16:57:19 > Task :reactor-tools:processResources NO-SOURCE
04-Dec-2020 16:57:19 > Task :reactor-tools:classes
04-Dec-2020 16:57:19 > Task :reactor-tools:compileBuildPluginTestJava
04-Dec-2020 16:57:19 > Task :reactor-tools:processBuildPluginTestResources NO-SOURCE
04-Dec-2020 16:57:19 > Task :reactor-tools:buildPluginTestClasses
04-Dec-2020 16:57:21
04-Dec-2020 16:57:21 > Task :reactor-tools:buildPluginTest
04-Dec-2020 16:57:21 Test class reactor.tools.agent.ReactorDebugBuildPluginTest
04-Dec-2020 16:57:21
04-Dec-2020 16:57:21 Gradle Test Run :reactor-tools:buildPluginTest Results: SUCCESS (1 tests, 1 successes, 0 failures, 0 skipped)
04-Dec-2020 16:57:21
04-Dec-2020 16:57:21 > Task :reactor-tools:compileJarFileTestJava
04-Dec-2020 16:57:21
04-Dec-2020 16:57:21 > Task :reactor-tools:processJarFileTestResources NO-SOURCE
04-Dec-2020 16:57:21 > Task :reactor-tools:jarFileTestClasses
04-Dec-2020 16:57:21 > Task :reactor-tools:jar
04-Dec-2020 16:57:21 Note: /opt/bamboo-home/xml-data/build-dir/REACTOR-RNEXT-JOB1/reactor-tools/src/jarFileTest/java/reactor/tools/JarFileShadingTest.java uses unchecked or unsafe operations.
04-Dec-2020 16:57:21 Note: Recompile with -Xlint:unchecked for details.
04-Dec-2020 16:57:21 > Task :reactor-tools:relocateShadowJar
04-Dec-2020 16:57:25 > Task :reactor-tools:shadowJar
04-Dec-2020 16:57:27
04-Dec-2020 16:57:27 > Task :reactor-tools:jarFileTest
04-Dec-2020 16:57:27 Test class reactor.tools.JarFileShadingTest
04-Dec-2020 16:57:27
04-Dec-2020 16:57:27 Gradle Test Run :reactor-tools:jarFileTest Results: SUCCESS (2 tests, 2 successes, 0 failures, 0 skipped)
04-Dec-2020 16:57:27
04-Dec-2020 16:57:27 > Task :reactor-tools:compileJavaAgentTestJava
04-Dec-2020 16:57:27 > Task :reactor-tools:processJavaAgentTestResources NO-SOURCE
04-Dec-2020 16:57:27 > Task :reactor-tools:javaAgentTestClasses
04-Dec-2020 16:57:29
04-Dec-2020 16:57:29 > Task :reactor-tools:javaAgentTest
04-Dec-2020 16:57:29 Test class reactor.tools.agent.ReactorDebugJavaAgentTest
04-Dec-2020 16:57:30
04-Dec-2020 16:57:30 Gradle Test Run :reactor-tools:javaAgentTest Results: SUCCESS (3 tests, 3 successes, 0 failures, 0 skipped)
04-Dec-2020 16:57:30
04-Dec-2020 16:57:30 > Task :reactor-tools:compileTestJava
04-Dec-2020 16:57:30 > Task :reactor-tools:processTestResources NO-SOURCE
04-Dec-2020 16:57:30 > Task :reactor-tools:testClasses
04-Dec-2020 16:57:32
04-Dec-2020 16:57:32 > Task :reactor-tools:shadedJarTest
04-Dec-2020 16:57:32 Test class reactor.tools.agent.ReactorDebugAgentTest
04-Dec-2020 16:57:34
04-Dec-2020 16:57:34 Gradle Test Run :reactor-tools:shadedJarTest Results: SUCCESS (8 tests, 8 successes, 0 failures, 0 skipped)
04-Dec-2020 16:57:36
04-Dec-2020 16:57:36 > Task :reactor-tools:test
04-Dec-2020 16:57:36 Test class reactor.tools.agent.ReactorDebugAgentTest
04-Dec-2020 16:57:38
04-Dec-2020 16:57:38 Gradle Test Run :reactor-tools:test Results: SUCCESS (8 tests, 8 successes, 0 failures, 0 skipped)
04-Dec-2020 16:57:38
04-Dec-2020 16:57:38 > Task :reactor-tools:check
04-Dec-2020 16:57:43
04-Dec-2020 16:57:43 > Task :asciidoctor
04-Dec-2020 16:57:43 Converting /opt/bamboo-home/xml-data/build-dir/REACTOR-RNEXT-JOB1/docs/asciidoc/index.asciidoc
04-Dec-2020 16:57:50
04-Dec-2020 16:57:50 > Task :asciidoctorPdf
04-Dec-2020 16:57:50 Converting /opt/bamboo-home/xml-data/build-dir/REACTOR-RNEXT-JOB1/docs/asciidoc/index.asciidoc
04-Dec-2020 16:58:34
04-Dec-2020 16:58:34 > Task :docsZip
04-Dec-2020 16:58:34 > Task :assemble
04-Dec-2020 16:58:34 > Task :benchmarks:jar
04-Dec-2020 16:58:34 > Task :benchmarks:assemble
04-Dec-2020 16:58:34 > Task :reactor-core:distTar NO-SOURCE
04-Dec-2020 16:58:34 > Task :reactor-core:distZip NO-SOURCE
04-Dec-2020 16:58:34 > Task :reactor-core:jcstressScripts
04-Dec-2020 16:58:34 > Task :reactor-core:jcstressDistTar
04-Dec-2020 16:58:34 > Task :reactor-core:jcstressDistZip
04-Dec-2020 16:58:34 > Task :reactor-core:assemble
04-Dec-2020 16:58:34 > Task :reactor-test:assemble
04-Dec-2020 16:58:34 > Task :reactor-tools:assemble
04-Dec-2020 16:58:34 > Task :reactor-core:generateMetadataFileForMavenJavaPublication
04-Dec-2020 16:58:34 > Task :reactor-core:generatePomFileForMavenJavaPublication
04-Dec-2020 16:58:39
04-Dec-2020 16:58:39 > Task :reactor-core:javadoc
04-Dec-2020 16:58:39 /opt/bamboo-home/xml-data/build-dir/REACTOR-RNEXT-JOB1/reactor-core/src/main/java/reactor/core/publisher/Sinks.java:675: warning - Tag @link: can't find emitComplete(EmitFailureHandler) in reactor.core.publisher.Sinks.Many
04-Dec-2020 16:58:39 /opt/bamboo-home/xml-data/build-dir/REACTOR-RNEXT-JOB1/reactor-core/src/main/java/reactor/core/publisher/Sinks.java:688: warning - Tag @link: can't find emitError(Throwable, EmitFailureHandler) in reactor.core.publisher.Sinks.Many
04-Dec-2020 16:58:39 /opt/bamboo-home/xml-data/build-dir/REACTOR-RNEXT-JOB1/reactor-core/src/main/java/reactor/core/publisher/Sinks.java:663: warning - Tag @link: can't find emitNext(Object, EmitFailureHandler) in reactor.core.publisher.Sinks.Many
04-Dec-2020 16:58:40 /opt/bamboo-home/xml-data/build-dir/REACTOR-RNEXT-JOB1/reactor-core/src/main/java/reactor/core/publisher/Mono.java:115: warning - Tag @link: can't find onNext(T) in org.reactivestreams.Subscriber
04-Dec-2020 16:58:40 /opt/bamboo-home/xml-data/build-dir/REACTOR-RNEXT-JOB1/reactor-core/src/main/java/reactor/core/publisher/Sinks.java:874: warning - Tag @link: can't find emitEmpty(EmitFailureHandler) in reactor.core.publisher.Sinks.Empty
04-Dec-2020 16:58:40 /opt/bamboo-home/xml-data/build-dir/REACTOR-RNEXT-JOB1/reactor-core/src/main/java/reactor/core/publisher/Sinks.java:888: warning - Tag @link: can't find emitError(Throwable, EmitFailureHandler) in reactor.core.publisher.Sinks.Empty
04-Dec-2020 16:58:40 /opt/bamboo-home/xml-data/build-dir/REACTOR-RNEXT-JOB1/reactor-core/src/main/java/reactor/core/publisher/Sinks.java:1033: warning - Tag @link: can't find emitValue(Object, EmitFailureHandler) in reactor.core.publisher.Sinks.One
04-Dec-2020 16:58:41 7 warnings
04-Dec-2020 16:58:41
04-Dec-2020 16:58:41 > Task :reactor-core:javadocJar
04-Dec-2020 16:58:42 > Task :reactor-core:sourcesJar
04-Dec-2020 16:58:42 > Task :reactor-core:artifactoryPublish
04-Dec-2020 16:58:42 > Task :reactor-test:generateMetadataFileForMavenJavaPublication
04-Dec-2020 16:58:42 > Task :reactor-test:generatePomFileForMavenJavaPublication
04-Dec-2020 16:58:44 > Task :reactor-test:javadoc
04-Dec-2020 16:58:44 > Task :reactor-test:javadocJar
04-Dec-2020 16:58:44 > Task :reactor-test:sourcesJar
04-Dec-2020 16:58:44 > Task :reactor-test:artifactoryPublish
04-Dec-2020 16:58:44 > Task :reactor-tools:generateMetadataFileForMavenJavaPublication
04-Dec-2020 16:58:44 > Task :reactor-tools:generatePomFileForMavenJavaPublication
04-Dec-2020 16:58:46 > Task :reactor-tools:javadoc
04-Dec-2020 16:58:46 > Task :reactor-tools:javadocJar
04-Dec-2020 16:58:46 > Task :reactor-tools:sourcesJar
04-Dec-2020 16:58:46 > Task :reactor-tools:artifactoryPublish
04-Dec-2020 16:58:46 > Task :artifactoryPublish
04-Dec-2020 16:58:46 > Task :extractModuleInfo
04-Dec-2020 16:58:47 > Task :reactor-core:extractModuleInfo
04-Dec-2020 16:58:47 > Task :reactor-test:extractModuleInfo
04-Dec-2020 16:58:47 > Task :reactor-tools:extractModuleInfo
04-Dec-2020 16:58:47 [pool-3-thread-2] Deploying artifact: https://repo.spring.io/libs-snapshot-local/io/projectreactor/reactor-test/3.4.1-SNAPSHOT/reactor-test-3.4.1-SNAPSHOT-javadoc.jar
04-Dec-2020 16:58:47 [pool-3-thread-3] Deploying artifact: https://repo.spring.io/libs-snapshot-local/io/projectreactor/reactor-tools/3.4.1-SNAPSHOT/reactor-tools-3.4.1-SNAPSHOT-javadoc.jar
04-Dec-2020 16:58:47 [pool-3-thread-1] Deploying artifact: https://repo.spring.io/libs-snapshot-local/io/projectreactor/reactor-core/3.4.1-SNAPSHOT/reactor-core-3.4.1-SNAPSHOT-docs.zip
04-Dec-2020 16:58:48 [pool-3-thread-3] Deploying artifact: https://repo.spring.io/libs-snapshot-local/io/projectreactor/reactor-tools/3.4.1-SNAPSHOT/reactor-tools-3.4.1-SNAPSHOT-original.jar
04-Dec-2020 16:58:48 [pool-3-thread-2] Deploying artifact: https://repo.spring.io/libs-snapshot-local/io/projectreactor/reactor-test/3.4.1-SNAPSHOT/reactor-test-3.4.1-SNAPSHOT-sources.jar
04-Dec-2020 16:58:49 [pool-3-thread-3] Deploying artifact: https://repo.spring.io/libs-snapshot-local/io/projectreactor/reactor-tools/3.4.1-SNAPSHOT/reactor-tools-3.4.1-SNAPSHOT-sources.jar
04-Dec-2020 16:58:49 [pool-3-thread-2] Deploying artifact: https://repo.spring.io/libs-snapshot-local/io/projectreactor/reactor-test/3.4.1-SNAPSHOT/reactor-test-3.4.1-SNAPSHOT.jar
04-Dec-2020 16:58:49 [pool-3-thread-1] Deploying artifact: https://repo.spring.io/libs-snapshot-local/io/projectreactor/reactor-core/3.4.1-SNAPSHOT/reactor-core-3.4.1-SNAPSHOT-javadoc.jar
04-Dec-2020 16:58:49 [pool-3-thread-3] Deploying artifact: https://repo.spring.io/libs-snapshot-local/io/projectreactor/reactor-tools/3.4.1-SNAPSHOT/reactor-tools-3.4.1-SNAPSHOT.jar
04-Dec-2020 16:58:49 [pool-3-thread-2] Deploying artifact: https://repo.spring.io/libs-snapshot-local/io/projectreactor/reactor-test/3.4.1-SNAPSHOT/reactor-test-3.4.1-SNAPSHOT.module
04-Dec-2020 16:58:49 [pool-3-thread-1] Deploying artifact: https://repo.spring.io/libs-snapshot-local/io/projectreactor/reactor-core/3.4.1-SNAPSHOT/reactor-core-3.4.1-SNAPSHOT-sources.jar
04-Dec-2020 16:58:49 [pool-3-thread-2] Deploying artifact: https://repo.spring.io/libs-snapshot-local/io/projectreactor/reactor-test/3.4.1-SNAPSHOT/reactor-test-3.4.1-SNAPSHOT.pom
04-Dec-2020 16:58:50 [pool-3-thread-3] Deploying artifact: https://repo.spring.io/libs-snapshot-local/io/projectreactor/reactor-tools/3.4.1-SNAPSHOT/reactor-tools-3.4.1-SNAPSHOT.module
04-Dec-2020 16:58:50 [pool-3-thread-1] Deploying artifact: https://repo.spring.io/libs-snapshot-local/io/projectreactor/reactor-core/3.4.1-SNAPSHOT/reactor-core-3.4.1-SNAPSHOT.jar
04-Dec-2020 16:58:50 [pool-3-thread-3] Deploying artifact: https://repo.spring.io/libs-snapshot-local/io/projectreactor/reactor-tools/3.4.1-SNAPSHOT/reactor-tools-3.4.1-SNAPSHOT.pom
04-Dec-2020 16:58:51 [pool-3-thread-1] Deploying artifact: https://repo.spring.io/libs-snapshot-local/io/projectreactor/reactor-core/3.4.1-SNAPSHOT/reactor-core-3.4.1-SNAPSHOT.module
04-Dec-2020 16:58:51 [pool-3-thread-1] Deploying artifact: https://repo.spring.io/libs-snapshot-local/io/projectreactor/reactor-core/3.4.1-SNAPSHOT/reactor-core-3.4.1-SNAPSHOT.pom
04-Dec-2020 16:58:51
04-Dec-2020 16:58:51 > Task :artifactoryDeploy
04-Dec-2020 16:58:51 Deploying build descriptor to: https://repo.spring.io/api/build
04-Dec-2020 16:58:52 Build successfully deployed. Browse it in Artifactory under https://repo.spring.io/webapp/builds/Project%20Reactor%20-%20Reactor%20Core%20NEXT%20-%20Core/2989
04-Dec-2020 16:58:52
04-Dec-2020 16:58:52 Deprecated Gradle features were used in this build, making it incompatible with Gradle 7.0.
04-Dec-2020 16:58:52 Use '--warning-mode all' to show the individual deprecation warnings.
04-Dec-2020 16:58:52 See https://docs.gradle.org/6.5.1/userguide/command_line_interface.html#sec:command_line_warnings
04-Dec-2020 16:58:52
04-Dec-2020 16:58:52 BUILD SUCCESSFUL in 15m 51s
04-Dec-2020 16:58:52 83 actionable tasks: 79 executed, 4 up-to-date
04-Dec-2020 16:58:52 Parsing test results under /opt/bamboo-home/xml-data/build-dir/REACTOR-RNEXT-JOB1...
04-Dec-2020 16:58:53 Finished task 'Build Test Assemble' with result: Success
04-Dec-2020 16:58:53 Running post build plugin 'Docker Container Cleanup'
04-Dec-2020 16:58:53 Running post build plugin 'NCover Results Collector'
04-Dec-2020 16:58:53 Running post build plugin 'Artifactory Release Management Staging'
04-Dec-2020 16:58:53 Running post build plugin 'Artifactory Build Info Copier'
04-Dec-2020 16:58:53 Running post build plugin 'Artifactory Gradle Properties Info Copier'
04-Dec-2020 16:58:53 Running post build plugin 'Clover Results Collector'
04-Dec-2020 16:58:53 Running post build plugin 'npm Cache Cleanup'
04-Dec-2020 16:58:53 Running post build plugin 'Artifact Copier'
04-Dec-2020 16:58:53 Publishing an artifact: test-report
04-Dec-2020 16:58:53 Finished publishing of artifact Non required job artifact: [test-report], pattern: [**/build/reports/tests/**] in 369.5 ms
04-Dec-2020 16:58:53 Successfully removed working directory at '/opt/bamboo-home/xml-data/build-dir/REACTOR-RNEXT-JOB1'
04-Dec-2020 16:58:53 Finalising the build...
04-Dec-2020 16:58:53 Stopping timer.
04-Dec-2020 16:58:53 Build REACTOR-RNEXT-JOB1-2989 completed.
04-Dec-2020 16:58:54 Running on server: post build plugin 'NCover Results Collector'
04-Dec-2020 16:58:54 Running on server: post build plugin 'Build Hanging Detection Configuration'
04-Dec-2020 16:58:54 Running on server: post build plugin 'Bamboo project link creator'
04-Dec-2020 16:58:54 Running on server: post build plugin 'Clover Delta Calculator'
04-Dec-2020 16:58:54 Running on server: post build plugin 'Maven Dependencies Postprocessor'
04-Dec-2020 16:58:54 All post build plugins have finished
04-Dec-2020 16:58:54 Generating build results summary...
04-Dec-2020 16:58:55 Saving build results to disk...
04-Dec-2020 16:58:55 Logging substituted variables...
04-Dec-2020 16:58:55 Indexing build results...
04-Dec-2020 16:58:55 Finished building REACTOR-RNEXT-JOB1-2989.