Build #150

Build: #150 failed Changes by Eric Bottard <bottarde@vmware.com>

Build result summary

Details

Completed
Duration
7 minutes
Labels
None
Agent
bamboo-21.af.pivotal.io
Revision
0be35b9c31c40f3f007e6199f280f0f75afa09b9 0be35b9c31c40f3f007e6199f280f0f75afa09b9
Total tests
6771
Fixed in
#151 (Changes by Eric Bottard <bottarde@vmware.com>)

Tests

Responsible

No one has taken responsibility for this failure

Code commits

Author Commit Message Commit date
Eric Bottard <bottarde@vmware.com> Eric Bottard <bottarde@vmware.com> 0be35b9c31c40f3f007e6199f280f0f75afa09b9 0be35b9c31c40f3f007e6199f280f0f75afa09b9 Introduce jcstress in 3.3.x
Backport tests from 3.4.x that apply to 3.3.x

Fixes #2629

Tests

New test failures 1
Status Test View job Duration
Collapse Failed FluxPublishOnTest rejectedExecutionExceptionOnDataSignalExecutor() History
Core 5 secs
java.util.concurrent.TimeoutException: java.util.concurrent.TimeoutException: rejectedExecutionExceptionOnDataSignalExecutor() timed out after 5 seconds
java.util.concurrent.TimeoutException: rejectedExecutionExceptionOnDataSignalExecutor() timed out after 5 seconds
	at org.junit.jupiter.engine.extension.TimeoutInvocation.createTimeoutException(TimeoutInvocation.java:70)
	at org.junit.jupiter.engine.extension.TimeoutInvocation.proceed(TimeoutInvocation.java:59)
	at org.junit.jupiter.engine.extension.TimeoutExtension.intercept(TimeoutExtension.java:149)
	at org.junit.jupiter.engine.extension.TimeoutExtension.interceptTestableMethod(TimeoutExtension.java:140)
	at org.junit.jupiter.engine.extension.TimeoutExtension.interceptTestMethod(TimeoutExtension.java:84)
	at org.junit.jupiter.engine.execution.ExecutableInvoker$ReflectiveInterceptorCall.lambda$ofVoidMethod$0(ExecutableInvoker.java:115)
(91 more lines...)