Build: #13 failed Changes by Simon Basle

Build result summary

Details

Completed
Duration
2 minutes
Labels
None
Agent
bamboo-14.af.pivotal.io
Revision
15525e7f3aaf4632feeabf56d893f06eea983b7d 15525e7f3aaf4632feeabf56d893f06eea983b7d
Total tests
247
Failing since
#12 (Changes by Simon Baslé <simon.basle@gmail.com>)
Fixed in
#14 (Manual run by Simon Basle)

Responsible

This build has been failing since #12
No one has taken responsibility

Code commits

Author Commit Message Commit date
Simon Basle Simon Basle 15525e7f3aaf4632feeabf56d893f06eea983b7d 15525e7f3aaf4632feeabf56d893f06eea983b7d [chores] Fix header for InstrumentedPool

Tests

New test failures 1
Status Test View job Duration
Collapse Failed AffinityPoolTest fastPathMetrics(int, boolean)[5] History
Reactor Pool 1 sec
java.lang.AssertionError: java.lang.AssertionError: [fastpath] 
Expecting:
  <14L>
to be close to:
  <30L>
by less than 50% but difference was 53.333333333333336%.
(a difference of exactly 50% being considered valid)
java.lang.AssertionError: [fastpath] 
(121 more lines...)
Fixed tests 1
Status Test Failing since View job Duration
Successful CommonPoolTest smokeTestAsyncLifo(Function)[2] History
Failing since build #12 (Changes by Simon Baslé <simon.basle@gmail.com>) Reactor Pool 2 secs