Build #126

Build: #126 was successful

Job: Reactor Pool was successful

Stages & jobs

  1. Default Stage

Build log

The build generated 2,101 lines of output.The output is too long and has been truncated to the last 1,000 lines. Download or view full build log

16-Oct-2020 08:33:01 CommonPoolTest > [2] configAdjuster=LRU & LIFO PASSED
16-Oct-2020 08:33:02
16-Oct-2020 08:33:02 CommonPoolTest > [3] configAdjuster=MRU & FIFO PASSED
16-Oct-2020 08:33:02
16-Oct-2020 08:33:02 CommonPoolTest > [4] configAdjuster=MRU & LIFO PASSED
16-Oct-2020 08:33:02
16-Oct-2020 08:33:02 CommonPoolTest > [1] configAdjuster=LRU & FIFO PASSED
16-Oct-2020 08:33:03
16-Oct-2020 08:33:03 CommonPoolTest > [2] configAdjuster=LRU & LIFO PASSED
16-Oct-2020 08:33:03
16-Oct-2020 08:33:03 CommonPoolTest > [3] configAdjuster=MRU & FIFO PASSED
16-Oct-2020 08:33:03
16-Oct-2020 08:33:03 CommonPoolTest > [4] configAdjuster=MRU & LIFO PASSED
16-Oct-2020 08:33:04
16-Oct-2020 08:33:04 CommonPoolTest > [1] configAdjuster=LRU & FIFO PASSED
16-Oct-2020 08:33:06
16-Oct-2020 08:33:06 CommonPoolTest > [2] configAdjuster=LRU & LIFO PASSED
16-Oct-2020 08:33:08
16-Oct-2020 08:33:08 CommonPoolTest > [3] configAdjuster=MRU & FIFO PASSED
16-Oct-2020 08:33:10
16-Oct-2020 08:33:10 CommonPoolTest > [4] configAdjuster=MRU & LIFO PASSED
16-Oct-2020 08:33:10
16-Oct-2020 08:33:10 CommonPoolTest > [1] configAdjuster=LRU & FIFO PASSED
16-Oct-2020 08:33:10
16-Oct-2020 08:33:10 CommonPoolTest > [2] configAdjuster=LRU & LIFO PASSED
16-Oct-2020 08:33:10
16-Oct-2020 08:33:10 CommonPoolTest > [3] configAdjuster=MRU & FIFO PASSED
16-Oct-2020 08:33:10
16-Oct-2020 08:33:10 CommonPoolTest > [4] configAdjuster=MRU & LIFO PASSED
16-Oct-2020 08:33:12
16-Oct-2020 08:33:12 CommonPoolTest > [1] configAdjuster=LRU & FIFO PASSED
16-Oct-2020 08:33:14
16-Oct-2020 08:33:14 CommonPoolTest > [2] configAdjuster=MRU & FIFO PASSED
16-Oct-2020 08:33:16
16-Oct-2020 08:33:16 CommonPoolTest > [1] configAdjuster=LRU & LIFO PASSED
16-Oct-2020 08:33:18
16-Oct-2020 08:33:18 CommonPoolTest > [2] configAdjuster=MRU & LIFO PASSED
16-Oct-2020 08:33:18
16-Oct-2020 08:33:18 CommonPoolTest > [1] configAdjuster=LRU & FIFO PASSED
16-Oct-2020 08:33:18
16-Oct-2020 08:33:18 CommonPoolTest > [2] configAdjuster=LRU & LIFO PASSED
16-Oct-2020 08:33:18
16-Oct-2020 08:33:18 CommonPoolTest > [3] configAdjuster=MRU & FIFO PASSED
16-Oct-2020 08:33:18
16-Oct-2020 08:33:18 CommonPoolTest > [4] configAdjuster=MRU & LIFO PASSED
16-Oct-2020 08:33:18
16-Oct-2020 08:33:18 CommonPoolTest > [1] configAdjuster=LRU & FIFO PASSED
16-Oct-2020 08:33:18
16-Oct-2020 08:33:18 CommonPoolTest > [2] configAdjuster=LRU & LIFO PASSED
16-Oct-2020 08:33:18
16-Oct-2020 08:33:18 CommonPoolTest > [3] configAdjuster=MRU & FIFO PASSED
16-Oct-2020 08:33:18
16-Oct-2020 08:33:18 CommonPoolTest > [4] configAdjuster=MRU & LIFO PASSED
16-Oct-2020 08:33:18
16-Oct-2020 08:33:18 CommonPoolTest > [1] configAdjuster=LRU & FIFO PASSED
16-Oct-2020 08:33:18
16-Oct-2020 08:33:18 CommonPoolTest > [2] configAdjuster=LRU & LIFO PASSED
16-Oct-2020 08:33:18
16-Oct-2020 08:33:18 CommonPoolTest > [3] configAdjuster=MRU & FIFO PASSED
16-Oct-2020 08:33:18
16-Oct-2020 08:33:18 CommonPoolTest > [4] configAdjuster=MRU & LIFO PASSED
16-Oct-2020 08:33:18
16-Oct-2020 08:33:18 CommonPoolTest > [1] configAdjuster=LRU & FIFO PASSED
16-Oct-2020 08:33:18
16-Oct-2020 08:33:18 CommonPoolTest > [2] configAdjuster=LRU & LIFO PASSED
16-Oct-2020 08:33:19
16-Oct-2020 08:33:19 CommonPoolTest > [3] configAdjuster=MRU & FIFO PASSED
16-Oct-2020 08:33:19
16-Oct-2020 08:33:19 CommonPoolTest > [4] configAdjuster=MRU & LIFO PASSED
16-Oct-2020 08:33:19
16-Oct-2020 08:33:19 CommonPoolTest > [1] configAdjuster=LRU & FIFO PASSED
16-Oct-2020 08:33:19
16-Oct-2020 08:33:19 CommonPoolTest > [2] configAdjuster=LRU & LIFO PASSED
16-Oct-2020 08:33:20
16-Oct-2020 08:33:20 CommonPoolTest > [1] configAdjuster=LRU & FIFO PASSED
16-Oct-2020 08:33:21
16-Oct-2020 08:33:21 CommonPoolTest > [2] configAdjuster=LRU & LIFO PASSED
16-Oct-2020 08:33:22
16-Oct-2020 08:33:22 CommonPoolTest > [3] configAdjuster=MRU & FIFO PASSED
16-Oct-2020 08:33:23
16-Oct-2020 08:33:23 CommonPoolTest > [4] configAdjuster=MRU & LIFO PASSED
16-Oct-2020 08:33:23
16-Oct-2020 08:33:23 CommonPoolTest > [1] configAdjuster=LRU & FIFO PASSED
16-Oct-2020 08:33:23
16-Oct-2020 08:33:23 CommonPoolTest > [2] configAdjuster=LRU & LIFO PASSED
16-Oct-2020 08:33:23
16-Oct-2020 08:33:23 CommonPoolTest > [3] configAdjuster=MRU & FIFO PASSED
16-Oct-2020 08:33:23
16-Oct-2020 08:33:23 CommonPoolTest > [4] configAdjuster=MRU & LIFO PASSED
16-Oct-2020 08:33:23
16-Oct-2020 08:33:23 CommonPoolTest > [1] configAdjuster=LRU & FIFO STANDARD_OUT
16-Oct-2020 08:33:23     Oct 16 2020 08:33:23.530 [Test worker] DEBUG r.u.Loggers$LoggerFactory [Loggers.java:249] - Using Slf4j logging framework
16-Oct-2020 08:33:23
16-Oct-2020 08:33:23 CommonPoolTest > [1] configAdjuster=LRU & FIFO PASSED
16-Oct-2020 08:33:23
16-Oct-2020 08:33:23 CommonPoolTest > [2] configAdjuster=LRU & LIFO STANDARD_OUT
16-Oct-2020 08:33:23     Oct 16 2020 08:33:23.533 [Test worker] DEBUG r.u.Loggers$LoggerFactory [Loggers.java:249] - Using Slf4j logging framework
16-Oct-2020 08:33:23
16-Oct-2020 08:33:23 CommonPoolTest > [2] configAdjuster=LRU & LIFO PASSED
16-Oct-2020 08:33:23
16-Oct-2020 08:33:23 CommonPoolTest > [3] configAdjuster=MRU & FIFO STANDARD_OUT
16-Oct-2020 08:33:23     Oct 16 2020 08:33:23.535 [Test worker] DEBUG r.u.Loggers$LoggerFactory [Loggers.java:249] - Using Slf4j logging framework
16-Oct-2020 08:33:23
16-Oct-2020 08:33:23 CommonPoolTest > [3] configAdjuster=MRU & FIFO PASSED
16-Oct-2020 08:33:23
16-Oct-2020 08:33:23 CommonPoolTest > [4] configAdjuster=MRU & LIFO STANDARD_OUT
16-Oct-2020 08:33:23     Oct 16 2020 08:33:23.537 [Test worker] DEBUG r.u.Loggers$LoggerFactory [Loggers.java:249] - Using Slf4j logging framework
16-Oct-2020 08:33:23
16-Oct-2020 08:33:23 CommonPoolTest > [4] configAdjuster=MRU & LIFO PASSED
16-Oct-2020 08:33:23
16-Oct-2020 08:33:23 CommonPoolTest > IDLE_LRU_PENDING_FIFO PASSED
16-Oct-2020 08:33:23
16-Oct-2020 08:33:23 CommonPoolTest > IDLE_MRU_PENDING_FIFO PASSED
16-Oct-2020 08:33:23
16-Oct-2020 08:33:23 CommonPoolTest > IDLE_LRU_PENDING_LIFO PASSED
16-Oct-2020 08:33:23
16-Oct-2020 08:33:23 CommonPoolTest > IDLE_MRU_PENDING_LIFO PASSED
16-Oct-2020 08:33:23
16-Oct-2020 08:33:23 CommonPoolTest > [1] configAdjuster=LRU & FIFO PASSED
16-Oct-2020 08:33:23
16-Oct-2020 08:33:23 CommonPoolTest > [2] configAdjuster=MRU & FIFO PASSED
16-Oct-2020 08:33:23
16-Oct-2020 08:33:23 CommonPoolTest > [1] configAdjuster=LRU & LIFO PASSED
16-Oct-2020 08:33:23
16-Oct-2020 08:33:23 CommonPoolTest > [2] configAdjuster=MRU & LIFO PASSED
16-Oct-2020 08:33:23
16-Oct-2020 08:33:23 CommonPoolTest > [1] configAdjuster=LRU & FIFO PASSED
16-Oct-2020 08:33:24
16-Oct-2020 08:33:24 CommonPoolTest > [2] configAdjuster=LRU & LIFO PASSED
16-Oct-2020 08:33:24
16-Oct-2020 08:33:24 CommonPoolTest > [3] configAdjuster=MRU & FIFO PASSED
16-Oct-2020 08:33:24
16-Oct-2020 08:33:24 CommonPoolTest > [4] configAdjuster=MRU & LIFO PASSED
16-Oct-2020 08:33:24
16-Oct-2020 08:33:24 CommonPoolTest > [1] configAdjuster=LRU & FIFO STANDARD_OUT
16-Oct-2020 08:33:24     Oct 16 2020 08:33:24.776 [Test worker] DEBUG r.p.SimpleDequePool [Loggers.java:254] - should warm up 2 extra resources
16-Oct-2020 08:33:24     Oct 16 2020 08:33:24.777 [Test worker] DEBUG r.p.SimpleDequePool [Loggers.java:254] - warmed up extra resource 1/2
16-Oct-2020 08:33:24     Oct 16 2020 08:33:24.778 [Test worker] DEBUG r.p.SimpleDequePool [Loggers.java:254] - warmed up extra resource 2/2
16-Oct-2020 08:33:24     Oct 16 2020 08:33:24.778 [Test worker] DEBUG r.p.SimpleDequePool [Loggers.java:254] - should warm up 1 extra resources
16-Oct-2020 08:33:24     Oct 16 2020 08:33:24.779 [Test worker] DEBUG r.p.SimpleDequePool [Loggers.java:254] - warmed up extra resource 1/1
16-Oct-2020 08:33:24
16-Oct-2020 08:33:24 CommonPoolTest > [1] configAdjuster=LRU & FIFO PASSED
16-Oct-2020 08:33:24
16-Oct-2020 08:33:24 CommonPoolTest > [2] configAdjuster=LRU & LIFO STANDARD_OUT
16-Oct-2020 08:33:24     Oct 16 2020 08:33:24.880 [Test worker] DEBUG r.p.SimpleDequePool [Loggers.java:254] - should warm up 2 extra resources
16-Oct-2020 08:33:24     Oct 16 2020 08:33:24.881 [Test worker] DEBUG r.p.SimpleDequePool [Loggers.java:254] - warmed up extra resource 1/2
16-Oct-2020 08:33:24     Oct 16 2020 08:33:24.881 [Test worker] DEBUG r.p.SimpleDequePool [Loggers.java:254] - warmed up extra resource 2/2
16-Oct-2020 08:33:24     Oct 16 2020 08:33:24.882 [Test worker] DEBUG r.p.SimpleDequePool [Loggers.java:254] - should warm up 1 extra resources
16-Oct-2020 08:33:24     Oct 16 2020 08:33:24.882 [Test worker] DEBUG r.p.SimpleDequePool [Loggers.java:254] - warmed up extra resource 1/1
16-Oct-2020 08:33:25
16-Oct-2020 08:33:25 CommonPoolTest > [2] configAdjuster=LRU & LIFO PASSED
16-Oct-2020 08:33:25
16-Oct-2020 08:33:25 CommonPoolTest > [3] configAdjuster=MRU & FIFO STANDARD_OUT
16-Oct-2020 08:33:25     Oct 16 2020 08:33:24.983 [Test worker] DEBUG r.p.SimpleDequePool [Loggers.java:254] - should warm up 2 extra resources
16-Oct-2020 08:33:25     Oct 16 2020 08:33:24.984 [Test worker] DEBUG r.p.SimpleDequePool [Loggers.java:254] - warmed up extra resource 1/2
16-Oct-2020 08:33:25     Oct 16 2020 08:33:24.984 [Test worker] DEBUG r.p.SimpleDequePool [Loggers.java:254] - warmed up extra resource 2/2
16-Oct-2020 08:33:25     Oct 16 2020 08:33:24.985 [Test worker] DEBUG r.p.SimpleDequePool [Loggers.java:254] - should warm up 1 extra resources
16-Oct-2020 08:33:25     Oct 16 2020 08:33:24.985 [Test worker] DEBUG r.p.SimpleDequePool [Loggers.java:254] - warmed up extra resource 1/1
16-Oct-2020 08:33:25
16-Oct-2020 08:33:25 CommonPoolTest > [3] configAdjuster=MRU & FIFO PASSED
16-Oct-2020 08:33:25
16-Oct-2020 08:33:25 CommonPoolTest > [4] configAdjuster=MRU & LIFO STANDARD_OUT
16-Oct-2020 08:33:25     Oct 16 2020 08:33:25.086 [Test worker] DEBUG r.p.SimpleDequePool [Loggers.java:254] - should warm up 2 extra resources
16-Oct-2020 08:33:25     Oct 16 2020 08:33:25.087 [Test worker] DEBUG r.p.SimpleDequePool [Loggers.java:254] - warmed up extra resource 1/2
16-Oct-2020 08:33:25     Oct 16 2020 08:33:25.087 [Test worker] DEBUG r.p.SimpleDequePool [Loggers.java:254] - warmed up extra resource 2/2
16-Oct-2020 08:33:25     Oct 16 2020 08:33:25.087 [Test worker] DEBUG r.p.SimpleDequePool [Loggers.java:254] - should warm up 1 extra resources
16-Oct-2020 08:33:25     Oct 16 2020 08:33:25.088 [Test worker] DEBUG r.p.SimpleDequePool [Loggers.java:254] - warmed up extra resource 1/1
16-Oct-2020 08:33:25
16-Oct-2020 08:33:25 CommonPoolTest > [4] configAdjuster=MRU & LIFO PASSED
16-Oct-2020 08:33:25
16-Oct-2020 08:33:25 CommonPoolTest > [1] configAdjuster=LRU & FIFO PASSED
16-Oct-2020 08:33:25
16-Oct-2020 08:33:25 CommonPoolTest > [2] configAdjuster=LRU & LIFO PASSED
16-Oct-2020 08:33:25
16-Oct-2020 08:33:25 CommonPoolTest > [3] configAdjuster=MRU & FIFO PASSED
16-Oct-2020 08:33:25
16-Oct-2020 08:33:25 CommonPoolTest > [4] configAdjuster=MRU & LIFO PASSED
16-Oct-2020 08:33:25
16-Oct-2020 08:33:25 CommonPoolTest > [1] configAdjuster=LRU & FIFO STANDARD_OUT
16-Oct-2020 08:33:25     Oct 16 2020 08:33:25.205 [single-827] ERROR r.c.p.Operators [Loggers.java:319] - Operator called default onErrorDropped
16-Oct-2020 08:33:25     reactor.core.Exceptions$ErrorCallbackNotImplemented: reactor.pool.PoolAcquirePendingLimitException: Pending acquire queue has reached its maximum size of 1
16-Oct-2020 08:33:25     Caused by: reactor.pool.PoolAcquirePendingLimitException: Pending acquire queue has reached its maximum size of 1
16-Oct-2020 08:33:25             at reactor.pool.SimpleDequePool.pendingOffer(SimpleDequePool.java:455) [main/:na]
16-Oct-2020 08:33:25             at reactor.pool.SimpleDequePool.doAcquire(SimpleDequePool.java:255) [main/:na]
16-Oct-2020 08:33:25             at reactor.pool.AbstractPool$Borrower.request(AbstractPool.java:382) [main/:na]
16-Oct-2020 08:33:25             at reactor.core.publisher.FluxDoFinally$DoFinallySubscriber.request(FluxDoFinally.java:157) [reactor-core-3.4.0-SNAPSHOT.jar:3.4.0-SNAPSHOT]
16-Oct-2020 08:33:25             at reactor.core.publisher.MonoPeekTerminal$MonoTerminalPeekSubscriber.request(MonoPeekTerminal.java:139) [reactor-core-3.4.0-SNAPSHOT.jar:3.4.0-SNAPSHOT]
16-Oct-2020 08:33:25             at reactor.core.publisher.LambdaMonoSubscriber.onSubscribe(LambdaMonoSubscriber.java:121) [reactor-core-3.4.0-SNAPSHOT.jar:3.4.0-SNAPSHOT]
16-Oct-2020 08:33:25             at reactor.core.publisher.MonoPeekTerminal$MonoTerminalPeekSubscriber.onSubscribe(MonoPeekTerminal.java:152) [reactor-core-3.4.0-SNAPSHOT.jar:3.4.0-SNAPSHOT]
16-Oct-2020 08:33:25             at reactor.core.publisher.FluxDoFinally$DoFinallySubscriber.onSubscribe(FluxDoFinally.java:124) [reactor-core-3.4.0-SNAPSHOT.jar:3.4.0-SNAPSHOT]
16-Oct-2020 08:33:25             at reactor.pool.SimpleDequePool$QueueBorrowerMono.subscribe(SimpleDequePool.java:578) [main/:na]
16-Oct-2020 08:33:25             at reactor.core.publisher.Mono.subscribe(Mono.java:3987) [reactor-core-3.4.0-SNAPSHOT.jar:3.4.0-SNAPSHOT]
16-Oct-2020 08:33:25             at reactor.core.publisher.Mono.subscribeWith(Mono.java:4102) [reactor-core-3.4.0-SNAPSHOT.jar:3.4.0-SNAPSHOT]
16-Oct-2020 08:33:25             at reactor.core.publisher.Mono.subscribe(Mono.java:3819) [reactor-core-3.4.0-SNAPSHOT.jar:3.4.0-SNAPSHOT]
16-Oct-2020 08:33:25             at reactor.pool.CommonPoolTest.lambda$pendingLimitAsync$107(CommonPoolTest.java:977) [test/:na]
16-Oct-2020 08:33:25             at reactor.test.util.RaceTestUtils.lambda$race$2(RaceTestUtils.java:130) ~[reactor-test-3.4.0-SNAPSHOT.jar:3.4.0-SNAPSHOT]
16-Oct-2020 08:33:25             at reactor.core.scheduler.SchedulerTask.call(SchedulerTask.java:68) ~[reactor-core-3.4.0-SNAPSHOT.jar:3.4.0-SNAPSHOT]
16-Oct-2020 08:33:25             at reactor.core.scheduler.SchedulerTask.call(SchedulerTask.java:28) ~[reactor-core-3.4.0-SNAPSHOT.jar:3.4.0-SNAPSHOT]
16-Oct-2020 08:33:25             at java.util.concurrent.FutureTask.run(FutureTask.java:266) ~[na:1.8.0_232]
16-Oct-2020 08:33:25             at java.util.concurrent.ScheduledThreadPoolExecutor$ScheduledFutureTask.access$201(ScheduledThreadPoolExecutor.java:180) ~[na:1.8.0_232]
16-Oct-2020 08:33:25             at java.util.concurrent.ScheduledThreadPoolExecutor$ScheduledFutureTask.run(ScheduledThreadPoolExecutor.java:293) ~[na:1.8.0_232]
16-Oct-2020 08:33:25             at java.util.concurrent.ThreadPoolExecutor.runWorker(ThreadPoolExecutor.java:1149) ~[na:1.8.0_232]
16-Oct-2020 08:33:25             at java.util.concurrent.ThreadPoolExecutor$Worker.run(ThreadPoolExecutor.java:624) ~[na:1.8.0_232]
16-Oct-2020 08:33:25             at java.lang.Thread.run(Thread.java:748) ~[na:1.8.0_232]
16-Oct-2020 08:33:25
16-Oct-2020 08:33:25 CommonPoolTest > [1] configAdjuster=LRU & FIFO PASSED
16-Oct-2020 08:33:25
16-Oct-2020 08:33:25 CommonPoolTest > [2] configAdjuster=LRU & LIFO STANDARD_OUT
16-Oct-2020 08:33:25     Oct 16 2020 08:33:25.208 [single-827] ERROR r.c.p.Operators [Loggers.java:319] - Operator called default onErrorDropped
16-Oct-2020 08:33:25     reactor.core.Exceptions$ErrorCallbackNotImplemented: reactor.pool.PoolAcquirePendingLimitException: Pending acquire queue has reached its maximum size of 1
16-Oct-2020 08:33:25     Caused by: reactor.pool.PoolAcquirePendingLimitException: Pending acquire queue has reached its maximum size of 1
16-Oct-2020 08:33:25             at reactor.pool.SimpleDequePool.pendingOffer(SimpleDequePool.java:455) [main/:na]
16-Oct-2020 08:33:25             at reactor.pool.SimpleDequePool.doAcquire(SimpleDequePool.java:255) [main/:na]
16-Oct-2020 08:33:25             at reactor.pool.AbstractPool$Borrower.request(AbstractPool.java:382) [main/:na]
16-Oct-2020 08:33:25             at reactor.core.publisher.FluxDoFinally$DoFinallySubscriber.request(FluxDoFinally.java:157) [reactor-core-3.4.0-SNAPSHOT.jar:3.4.0-SNAPSHOT]
16-Oct-2020 08:33:25             at reactor.core.publisher.MonoPeekTerminal$MonoTerminalPeekSubscriber.request(MonoPeekTerminal.java:139) [reactor-core-3.4.0-SNAPSHOT.jar:3.4.0-SNAPSHOT]
16-Oct-2020 08:33:25             at reactor.core.publisher.LambdaMonoSubscriber.onSubscribe(LambdaMonoSubscriber.java:121) [reactor-core-3.4.0-SNAPSHOT.jar:3.4.0-SNAPSHOT]
16-Oct-2020 08:33:25             at reactor.core.publisher.MonoPeekTerminal$MonoTerminalPeekSubscriber.onSubscribe(MonoPeekTerminal.java:152) [reactor-core-3.4.0-SNAPSHOT.jar:3.4.0-SNAPSHOT]
16-Oct-2020 08:33:25             at reactor.core.publisher.FluxDoFinally$DoFinallySubscriber.onSubscribe(FluxDoFinally.java:124) [reactor-core-3.4.0-SNAPSHOT.jar:3.4.0-SNAPSHOT]
16-Oct-2020 08:33:25             at reactor.pool.SimpleDequePool$QueueBorrowerMono.subscribe(SimpleDequePool.java:578) [main/:na]
16-Oct-2020 08:33:25             at reactor.core.publisher.Mono.subscribe(Mono.java:3987) [reactor-core-3.4.0-SNAPSHOT.jar:3.4.0-SNAPSHOT]
16-Oct-2020 08:33:25             at reactor.core.publisher.Mono.subscribeWith(Mono.java:4102) [reactor-core-3.4.0-SNAPSHOT.jar:3.4.0-SNAPSHOT]
16-Oct-2020 08:33:25             at reactor.core.publisher.Mono.subscribe(Mono.java:3819) [reactor-core-3.4.0-SNAPSHOT.jar:3.4.0-SNAPSHOT]
16-Oct-2020 08:33:25             at reactor.pool.CommonPoolTest.lambda$pendingLimitAsync$107(CommonPoolTest.java:977) [test/:na]
16-Oct-2020 08:33:25             at reactor.test.util.RaceTestUtils.lambda$race$2(RaceTestUtils.java:130) ~[reactor-test-3.4.0-SNAPSHOT.jar:3.4.0-SNAPSHOT]
16-Oct-2020 08:33:25             at reactor.core.scheduler.SchedulerTask.call(SchedulerTask.java:68) ~[reactor-core-3.4.0-SNAPSHOT.jar:3.4.0-SNAPSHOT]
16-Oct-2020 08:33:25             at reactor.core.scheduler.SchedulerTask.call(SchedulerTask.java:28) ~[reactor-core-3.4.0-SNAPSHOT.jar:3.4.0-SNAPSHOT]
16-Oct-2020 08:33:25             at java.util.concurrent.FutureTask.run(FutureTask.java:266) ~[na:1.8.0_232]
16-Oct-2020 08:33:25             at java.util.concurrent.ScheduledThreadPoolExecutor$ScheduledFutureTask.access$201(ScheduledThreadPoolExecutor.java:180) ~[na:1.8.0_232]
16-Oct-2020 08:33:25             at java.util.concurrent.ScheduledThreadPoolExecutor$ScheduledFutureTask.run(ScheduledThreadPoolExecutor.java:293) ~[na:1.8.0_232]
16-Oct-2020 08:33:25             at java.util.concurrent.ThreadPoolExecutor.runWorker(ThreadPoolExecutor.java:1149) ~[na:1.8.0_232]
16-Oct-2020 08:33:25             at java.util.concurrent.ThreadPoolExecutor$Worker.run(ThreadPoolExecutor.java:624) ~[na:1.8.0_232]
16-Oct-2020 08:33:25             at java.lang.Thread.run(Thread.java:748) ~[na:1.8.0_232]
16-Oct-2020 08:33:25
16-Oct-2020 08:33:25 CommonPoolTest > [2] configAdjuster=LRU & LIFO PASSED
16-Oct-2020 08:33:25
16-Oct-2020 08:33:25 CommonPoolTest > [3] configAdjuster=MRU & FIFO STANDARD_OUT
16-Oct-2020 08:33:25     Oct 16 2020 08:33:25.219 [Test worker] ERROR r.c.p.Operators [Loggers.java:319] - Operator called default onErrorDropped
16-Oct-2020 08:33:25     reactor.core.Exceptions$ErrorCallbackNotImplemented: reactor.pool.PoolAcquirePendingLimitException: Pending acquire queue has reached its maximum size of 1
16-Oct-2020 08:33:25     Caused by: reactor.pool.PoolAcquirePendingLimitException: Pending acquire queue has reached its maximum size of 1
16-Oct-2020 08:33:25             at reactor.pool.SimpleDequePool.pendingOffer(SimpleDequePool.java:455) [main/:na]
16-Oct-2020 08:33:25             at reactor.pool.SimpleDequePool.doAcquire(SimpleDequePool.java:255) [main/:na]
16-Oct-2020 08:33:25             at reactor.pool.AbstractPool$Borrower.request(AbstractPool.java:382) [main/:na]
16-Oct-2020 08:33:25             at reactor.core.publisher.FluxDoFinally$DoFinallySubscriber.request(FluxDoFinally.java:157) [reactor-core-3.4.0-SNAPSHOT.jar:3.4.0-SNAPSHOT]
16-Oct-2020 08:33:25             at reactor.core.publisher.MonoPeekTerminal$MonoTerminalPeekSubscriber.request(MonoPeekTerminal.java:139) [reactor-core-3.4.0-SNAPSHOT.jar:3.4.0-SNAPSHOT]
16-Oct-2020 08:33:25             at reactor.core.publisher.LambdaMonoSubscriber.onSubscribe(LambdaMonoSubscriber.java:121) [reactor-core-3.4.0-SNAPSHOT.jar:3.4.0-SNAPSHOT]
16-Oct-2020 08:33:25             at reactor.core.publisher.MonoPeekTerminal$MonoTerminalPeekSubscriber.onSubscribe(MonoPeekTerminal.java:152) [reactor-core-3.4.0-SNAPSHOT.jar:3.4.0-SNAPSHOT]
16-Oct-2020 08:33:25             at reactor.core.publisher.FluxDoFinally$DoFinallySubscriber.onSubscribe(FluxDoFinally.java:124) [reactor-core-3.4.0-SNAPSHOT.jar:3.4.0-SNAPSHOT]
16-Oct-2020 08:33:25             at reactor.pool.SimpleDequePool$QueueBorrowerMono.subscribe(SimpleDequePool.java:578) [main/:na]
16-Oct-2020 08:33:25             at reactor.core.publisher.Mono.subscribe(Mono.java:3987) [reactor-core-3.4.0-SNAPSHOT.jar:3.4.0-SNAPSHOT]
16-Oct-2020 08:33:25             at reactor.core.publisher.Mono.subscribeWith(Mono.java:4102) [reactor-core-3.4.0-SNAPSHOT.jar:3.4.0-SNAPSHOT]
16-Oct-2020 08:33:25             at reactor.core.publisher.Mono.subscribe(Mono.java:3819) [reactor-core-3.4.0-SNAPSHOT.jar:3.4.0-SNAPSHOT]
16-Oct-2020 08:33:25             at reactor.pool.CommonPoolTest.lambda$pendingLimitAsync$107(CommonPoolTest.java:977) [test/:na]
16-Oct-2020 08:33:25             at reactor.test.util.RaceTestUtils.race(RaceTestUtils.java:145) ~[reactor-test-3.4.0-SNAPSHOT.jar:3.4.0-SNAPSHOT]
16-Oct-2020 08:33:25             at reactor.test.util.RaceTestUtils.race(RaceTestUtils.java:107) ~[reactor-test-3.4.0-SNAPSHOT.jar:3.4.0-SNAPSHOT]
16-Oct-2020 08:33:25             at reactor.pool.CommonPoolTest.pendingLimitAsync(CommonPoolTest.java:979) [test/:na]
16-Oct-2020 08:33:25             at sun.reflect.NativeMethodAccessorImpl.invoke0(Native Method) ~[na:1.8.0_232]
16-Oct-2020 08:33:25             at sun.reflect.NativeMethodAccessorImpl.invoke(NativeMethodAccessorImpl.java:62) ~[na:1.8.0_232]
16-Oct-2020 08:33:25             at sun.reflect.DelegatingMethodAccessorImpl.invoke(DelegatingMethodAccessorImpl.java:43) ~[na:1.8.0_232]
16-Oct-2020 08:33:25             at java.lang.reflect.Method.invoke(Method.java:498) ~[na:1.8.0_232]
16-Oct-2020 08:33:25             at org.junit.platform.commons.util.ReflectionUtils.invokeMethod(ReflectionUtils.java:686) ~[junit-platform-commons-1.6.0.jar:1.6.0]
16-Oct-2020 08:33:25             at org.junit.jupiter.engine.execution.MethodInvocation.proceed(MethodInvocation.java:60) ~[junit-jupiter-engine-5.6.0.jar:5.6.0]
16-Oct-2020 08:33:25             at org.junit.jupiter.engine.execution.InvocationInterceptorChain$ValidatingInvocation.proceed(InvocationInterceptorChain.java:131) ~[junit-jupiter-engine-5.6.0.jar:5.6.0]
16-Oct-2020 08:33:25             at org.junit.jupiter.engine.extension.TimeoutExtension.intercept(TimeoutExtension.java:149) ~[junit-jupiter-engine-5.6.0.jar:5.6.0]
16-Oct-2020 08:33:25             at org.junit.jupiter.engine.extension.TimeoutExtension.interceptTestableMethod(TimeoutExtension.java:140) ~[junit-jupiter-engine-5.6.0.jar:5.6.0]
16-Oct-2020 08:33:25             at org.junit.jupiter.engine.extension.TimeoutExtension.interceptTestTemplateMethod(TimeoutExtension.java:92) ~[junit-jupiter-engine-5.6.0.jar:5.6.0]
16-Oct-2020 08:33:25             at org.junit.jupiter.engine.execution.ExecutableInvoker$ReflectiveInterceptorCall.lambda$ofVoidMethod$0(ExecutableInvoker.java:115) ~[junit-jupiter-engine-5.6.0.jar:5.6.0]
16-Oct-2020 08:33:25             at org.junit.jupiter.engine.execution.ExecutableInvoker.lambda$invoke$0(ExecutableInvoker.java:105) ~[junit-jupiter-engine-5.6.0.jar:5.6.0]
16-Oct-2020 08:33:25             at org.junit.jupiter.engine.execution.InvocationInterceptorChain$InterceptedInvocation.proceed(InvocationInterceptorChain.java:106) ~[junit-jupiter-engine-5.6.0.jar:5.6.0]
16-Oct-2020 08:33:25             at org.junit.jupiter.engine.execution.InvocationInterceptorChain.proceed(InvocationInterceptorChain.java:64) ~[junit-jupiter-engine-5.6.0.jar:5.6.0]
16-Oct-2020 08:33:25             at org.junit.jupiter.engine.execution.InvocationInterceptorChain.chainAndInvoke(InvocationInterceptorChain.java:45) ~[junit-jupiter-engine-5.6.0.jar:5.6.0]
16-Oct-2020 08:33:25             at org.junit.jupiter.engine.execution.InvocationInterceptorChain.invoke(InvocationInterceptorChain.java:37) ~[junit-jupiter-engine-5.6.0.jar:5.6.0]
16-Oct-2020 08:33:25             at org.junit.jupiter.engine.execution.ExecutableInvoker.invoke(ExecutableInvoker.java:104) ~[junit-jupiter-engine-5.6.0.jar:5.6.0]
16-Oct-2020 08:33:25             at org.junit.jupiter.engine.execution.ExecutableInvoker.invoke(ExecutableInvoker.java:98) ~[junit-jupiter-engine-5.6.0.jar:5.6.0]
16-Oct-2020 08:33:25             at org.junit.jupiter.engine.descriptor.TestMethodTestDescriptor.lambda$invokeTestMethod$6(TestMethodTestDescriptor.java:205) ~[junit-jupiter-engine-5.6.0.jar:5.6.0]
16-Oct-2020 08:33:25             at org.junit.platform.engine.support.hierarchical.ThrowableCollector.execute(ThrowableCollector.java:73) ~[junit-platform-engine-1.6.0.jar:1.6.0]
16-Oct-2020 08:33:25             at org.junit.jupiter.engine.descriptor.TestMethodTestDescriptor.invokeTestMethod(TestMethodTestDescriptor.java:201) ~[junit-jupiter-engine-5.6.0.jar:5.6.0]
16-Oct-2020 08:33:25             at org.junit.jupiter.engine.descriptor.TestMethodTestDescriptor.execute(TestMethodTestDescriptor.java:137) ~[junit-jupiter-engine-5.6.0.jar:5.6.0]
16-Oct-2020 08:33:25             at org.junit.jupiter.engine.descriptor.TestMethodTestDescriptor.execute(TestMethodTestDescriptor.java:71) ~[junit-jupiter-engine-5.6.0.jar:5.6.0]
16-Oct-2020 08:33:25             at org.junit.platform.engine.support.hierarchical.NodeTestTask.lambda$executeRecursively$5(NodeTestTask.java:135) ~[junit-platform-engine-1.6.0.jar:1.6.0]
16-Oct-2020 08:33:25             at org.junit.platform.engine.support.hierarchical.ThrowableCollector.execute(ThrowableCollector.java:73) ~[junit-platform-engine-1.6.0.jar:1.6.0]
16-Oct-2020 08:33:25             at org.junit.platform.engine.support.hierarchical.NodeTestTask.lambda$executeRecursively$7(NodeTestTask.java:125) ~[junit-platform-engine-1.6.0.jar:1.6.0]
16-Oct-2020 08:33:25             at org.junit.platform.engine.support.hierarchical.Node.around(Node.java:135) ~[junit-platform-engine-1.6.0.jar:1.6.0]
16-Oct-2020 08:33:25             at org.junit.platform.engine.support.hierarchical.NodeTestTask.lambda$executeRecursively$8(NodeTestTask.java:123) ~[junit-platform-engine-1.6.0.jar:1.6.0]
16-Oct-2020 08:33:25             at org.junit.platform.engine.support.hierarchical.ThrowableCollector.execute(ThrowableCollector.java:73) ~[junit-platform-engine-1.6.0.jar:1.6.0]
16-Oct-2020 08:33:25             at org.junit.platform.engine.support.hierarchical.NodeTestTask.executeRecursively(NodeTestTask.java:122) ~[junit-platform-engine-1.6.0.jar:1.6.0]
16-Oct-2020 08:33:25             at org.junit.platform.engine.support.hierarchical.NodeTestTask.execute(NodeTestTask.java:80) ~[junit-platform-engine-1.6.0.jar:1.6.0]
16-Oct-2020 08:33:25             at org.junit.platform.engine.support.hierarchical.SameThreadHierarchicalTestExecutorService.submit(SameThreadHierarchicalTestExecutorService.java:32) ~[junit-platform-engine-1.6.0.jar:1.6.0]
16-Oct-2020 08:33:25             at org.junit.platform.engine.support.hierarchical.NodeTestTask$DefaultDynamicTestExecutor.execute(NodeTestTask.java:198) ~[junit-platform-engine-1.6.0.jar:1.6.0]
16-Oct-2020 08:33:25             at org.junit.jupiter.engine.descriptor.TestTemplateTestDescriptor.execute(TestTemplateTestDescriptor.java:138) ~[junit-jupiter-engine-5.6.0.jar:5.6.0]
16-Oct-2020 08:33:25             at org.junit.jupiter.engine.descriptor.TestTemplateTestDescriptor.lambda$execute$2(TestTemplateTestDescriptor.java:106) ~[junit-jupiter-engine-5.6.0.jar:5.6.0]
16-Oct-2020 08:33:25             at java.util.stream.ForEachOps$ForEachOp$OfRef.accept(ForEachOps.java:183) ~[na:1.8.0_232]
16-Oct-2020 08:33:25             at java.util.stream.ReferencePipeline$3$1.accept(ReferencePipeline.java:193) ~[na:1.8.0_232]
16-Oct-2020 08:33:25             at java.util.stream.ReferencePipeline$2$1.accept(ReferencePipeline.java:175) ~[na:1.8.0_232]
16-Oct-2020 08:33:25             at java.util.stream.ReferencePipeline$3$1.accept(ReferencePipeline.java:193) ~[na:1.8.0_232]
16-Oct-2020 08:33:25             at java.util.stream.ForEachOps$ForEachOp$OfRef.accept(ForEachOps.java:183) ~[na:1.8.0_232]
16-Oct-2020 08:33:25             at java.util.stream.ReferencePipeline$11$1.accept(ReferencePipeline.java:440) ~[na:1.8.0_232]
16-Oct-2020 08:33:25             at java.util.stream.ReferencePipeline$3$1.accept(ReferencePipeline.java:193) ~[na:1.8.0_232]
16-Oct-2020 08:33:25             at java.util.stream.ReferencePipeline$3$1.accept(ReferencePipeline.java:193) ~[na:1.8.0_232]
16-Oct-2020 08:33:25             at java.util.stream.ReferencePipeline$3$1.accept(ReferencePipeline.java:193) ~[na:1.8.0_232]
16-Oct-2020 08:33:25             at java.util.stream.ForEachOps$ForEachOp$OfRef.accept(ForEachOps.java:183) ~[na:1.8.0_232]
16-Oct-2020 08:33:25             at java.util.stream.ReferencePipeline$3$1.accept(ReferencePipeline.java:193) ~[na:1.8.0_232]
16-Oct-2020 08:33:25             at java.util.Spliterators$ArraySpliterator.forEachRemaining(Spliterators.java:948) ~[na:1.8.0_232]
16-Oct-2020 08:33:25             at java.util.stream.ReferencePipeline$Head.forEach(ReferencePipeline.java:647) ~[na:1.8.0_232]
16-Oct-2020 08:33:25             at java.util.stream.ReferencePipeline$7$1.accept(ReferencePipeline.java:272) ~[na:1.8.0_232]
16-Oct-2020 08:33:25             at java.util.stream.ReferencePipeline$3$1.accept(ReferencePipeline.java:193) ~[na:1.8.0_232]
16-Oct-2020 08:33:25             at java.util.stream.ReferencePipeline$3$1.accept(ReferencePipeline.java:193) ~[na:1.8.0_232]
16-Oct-2020 08:33:25             at java.util.Spliterators$ArraySpliterator.forEachRemaining(Spliterators.java:948) ~[na:1.8.0_232]
16-Oct-2020 08:33:25             at java.util.stream.AbstractPipeline.copyInto(AbstractPipeline.java:482) ~[na:1.8.0_232]
16-Oct-2020 08:33:25             at java.util.stream.AbstractPipeline.wrapAndCopyInto(AbstractPipeline.java:472) ~[na:1.8.0_232]
16-Oct-2020 08:33:25             at java.util.stream.ForEachOps$ForEachOp.evaluateSequential(ForEachOps.java:150) ~[na:1.8.0_232]
16-Oct-2020 08:33:25             at java.util.stream.ForEachOps$ForEachOp$OfRef.evaluateSequential(ForEachOps.java:173) ~[na:1.8.0_232]
16-Oct-2020 08:33:25             at java.util.stream.AbstractPipeline.evaluate(AbstractPipeline.java:234) ~[na:1.8.0_232]
16-Oct-2020 08:33:25             at java.util.stream.ReferencePipeline.forEach(ReferencePipeline.java:485) ~[na:1.8.0_232]
16-Oct-2020 08:33:25             at java.util.stream.ReferencePipeline$7$1.accept(ReferencePipeline.java:272) ~[na:1.8.0_232]
16-Oct-2020 08:33:25             at java.util.stream.ReferencePipeline$3$1.accept(ReferencePipeline.java:193) ~[na:1.8.0_232]
16-Oct-2020 08:33:25             at java.util.stream.ReferencePipeline$3$1.accept(ReferencePipeline.java:193) ~[na:1.8.0_232]
16-Oct-2020 08:33:25             at java.util.stream.ReferencePipeline$3$1.accept(ReferencePipeline.java:193) ~[na:1.8.0_232]
16-Oct-2020 08:33:25             at java.util.ArrayList$ArrayListSpliterator.forEachRemaining(ArrayList.java:1382) ~[na:1.8.0_232]
16-Oct-2020 08:33:25             at java.util.stream.AbstractPipeline.copyInto(AbstractPipeline.java:482) ~[na:1.8.0_232]
16-Oct-2020 08:33:25             at java.util.stream.AbstractPipeline.wrapAndCopyInto(AbstractPipeline.java:472) ~[na:1.8.0_232]
16-Oct-2020 08:33:25             at java.util.stream.ForEachOps$ForEachOp.evaluateSequential(ForEachOps.java:150) ~[na:1.8.0_232]
16-Oct-2020 08:33:25             at java.util.stream.ForEachOps$ForEachOp$OfRef.evaluateSequential(ForEachOps.java:173) ~[na:1.8.0_232]
16-Oct-2020 08:33:25             at java.util.stream.AbstractPipeline.evaluate(AbstractPipeline.java:234) ~[na:1.8.0_232]
16-Oct-2020 08:33:25             at java.util.stream.ReferencePipeline.forEach(ReferencePipeline.java:485) ~[na:1.8.0_232]
16-Oct-2020 08:33:25             at java.util.stream.ReferencePipeline$7$1.accept(ReferencePipeline.java:272) ~[na:1.8.0_232]
16-Oct-2020 08:33:25             at java.util.ArrayList$ArrayListSpliterator.forEachRemaining(ArrayList.java:1382) ~[na:1.8.0_232]
16-Oct-2020 08:33:25             at java.util.stream.AbstractPipeline.copyInto(AbstractPipeline.java:482) ~[na:1.8.0_232]
16-Oct-2020 08:33:25             at java.util.stream.AbstractPipeline.wrapAndCopyInto(AbstractPipeline.java:472) ~[na:1.8.0_232]
16-Oct-2020 08:33:25             at java.util.stream.ForEachOps$ForEachOp.evaluateSequential(ForEachOps.java:150) ~[na:1.8.0_232]
16-Oct-2020 08:33:25             at java.util.stream.ForEachOps$ForEachOp$OfRef.evaluateSequential(ForEachOps.java:173) ~[na:1.8.0_232]
16-Oct-2020 08:33:25             at java.util.stream.AbstractPipeline.evaluate(AbstractPipeline.java:234) ~[na:1.8.0_232]
16-Oct-2020 08:33:25             at java.util.stream.ReferencePipeline.forEach(ReferencePipeline.java:485) ~[na:1.8.0_232]
16-Oct-2020 08:33:25             at org.junit.jupiter.engine.descriptor.TestTemplateTestDescriptor.execute(TestTemplateTestDescriptor.java:106) ~[junit-jupiter-engine-5.6.0.jar:5.6.0]
16-Oct-2020 08:33:25             at org.junit.jupiter.engine.descriptor.TestTemplateTestDescriptor.execute(TestTemplateTestDescriptor.java:41) ~[junit-jupiter-engine-5.6.0.jar:5.6.0]
16-Oct-2020 08:33:25             at org.junit.platform.engine.support.hierarchical.NodeTestTask.lambda$executeRecursively$5(NodeTestTask.java:135) ~[junit-platform-engine-1.6.0.jar:1.6.0]
16-Oct-2020 08:33:25             at org.junit.platform.engine.support.hierarchical.ThrowableCollector.execute(ThrowableCollector.java:73) ~[junit-platform-engine-1.6.0.jar:1.6.0]
16-Oct-2020 08:33:25             at org.junit.platform.engine.support.hierarchical.NodeTestTask.lambda$executeRecursively$7(NodeTestTask.java:125) ~[junit-platform-engine-1.6.0.jar:1.6.0]
16-Oct-2020 08:33:25             at org.junit.platform.engine.support.hierarchical.Node.around(Node.java:135) ~[junit-platform-engine-1.6.0.jar:1.6.0]
16-Oct-2020 08:33:25             at org.junit.platform.engine.support.hierarchical.NodeTestTask.lambda$executeRecursively$8(NodeTestTask.java:123) ~[junit-platform-engine-1.6.0.jar:1.6.0]
16-Oct-2020 08:33:25             at org.junit.platform.engine.support.hierarchical.ThrowableCollector.execute(ThrowableCollector.java:73) ~[junit-platform-engine-1.6.0.jar:1.6.0]
16-Oct-2020 08:33:25             at org.junit.platform.engine.support.hierarchical.NodeTestTask.executeRecursively(NodeTestTask.java:122) ~[junit-platform-engine-1.6.0.jar:1.6.0]
16-Oct-2020 08:33:25             at org.junit.platform.engine.support.hierarchical.NodeTestTask.execute(NodeTestTask.java:80) ~[junit-platform-engine-1.6.0.jar:1.6.0]
16-Oct-2020 08:33:25             at java.util.ArrayList.forEach(ArrayList.java:1257) ~[na:1.8.0_232]
16-Oct-2020 08:33:25             at org.junit.platform.engine.support.hierarchical.SameThreadHierarchicalTestExecutorService.invokeAll(SameThreadHierarchicalTestExecutorService.java:38) ~[junit-platform-engine-1.6.0.jar:1.6.0]
16-Oct-2020 08:33:25             at org.junit.platform.engine.support.hierarchical.NodeTestTask.lambda$executeRecursively$5(NodeTestTask.java:139) ~[junit-platform-engine-1.6.0.jar:1.6.0]
16-Oct-2020 08:33:25             at org.junit.platform.engine.support.hierarchical.ThrowableCollector.execute(ThrowableCollector.java:73) ~[junit-platform-engine-1.6.0.jar:1.6.0]
16-Oct-2020 08:33:25             at org.junit.platform.engine.support.hierarchical.NodeTestTask.lambda$executeRecursively$7(NodeTestTask.java:125) ~[junit-platform-engine-1.6.0.jar:1.6.0]
16-Oct-2020 08:33:25             at org.junit.platform.engine.support.hierarchical.Node.around(Node.java:135) ~[junit-platform-engine-1.6.0.jar:1.6.0]
16-Oct-2020 08:33:25             at org.junit.platform.engine.support.hierarchical.NodeTestTask.lambda$executeRecursively$8(NodeTestTask.java:123) ~[junit-platform-engine-1.6.0.jar:1.6.0]
16-Oct-2020 08:33:25             at org.junit.platform.engine.support.hierarchical.ThrowableCollector.execute(ThrowableCollector.java:73) ~[junit-platform-engine-1.6.0.jar:1.6.0]
16-Oct-2020 08:33:25             at org.junit.platform.engine.support.hierarchical.NodeTestTask.executeRecursively(NodeTestTask.java:122) ~[junit-platform-engine-1.6.0.jar:1.6.0]
16-Oct-2020 08:33:25             at org.junit.platform.engine.support.hierarchical.NodeTestTask.execute(NodeTestTask.java:80) ~[junit-platform-engine-1.6.0.jar:1.6.0]
16-Oct-2020 08:33:25             at java.util.ArrayList.forEach(ArrayList.java:1257) ~[na:1.8.0_232]
16-Oct-2020 08:33:25             at org.junit.platform.engine.support.hierarchical.SameThreadHierarchicalTestExecutorService.invokeAll(SameThreadHierarchicalTestExecutorService.java:38) ~[junit-platform-engine-1.6.0.jar:1.6.0]
16-Oct-2020 08:33:25             at org.junit.platform.engine.support.hierarchical.NodeTestTask.lambda$executeRecursively$5(NodeTestTask.java:139) ~[junit-platform-engine-1.6.0.jar:1.6.0]
16-Oct-2020 08:33:25             at org.junit.platform.engine.support.hierarchical.ThrowableCollector.execute(ThrowableCollector.java:73) ~[junit-platform-engine-1.6.0.jar:1.6.0]
16-Oct-2020 08:33:25             at org.junit.platform.engine.support.hierarchical.NodeTestTask.lambda$executeRecursively$7(NodeTestTask.java:125) ~[junit-platform-engine-1.6.0.jar:1.6.0]
16-Oct-2020 08:33:25             at org.junit.platform.engine.support.hierarchical.Node.around(Node.java:135) ~[junit-platform-engine-1.6.0.jar:1.6.0]
16-Oct-2020 08:33:25             at org.junit.platform.engine.support.hierarchical.NodeTestTask.lambda$executeRecursively$8(NodeTestTask.java:123) ~[junit-platform-engine-1.6.0.jar:1.6.0]
16-Oct-2020 08:33:25             at org.junit.platform.engine.support.hierarchical.ThrowableCollector.execute(ThrowableCollector.java:73) ~[junit-platform-engine-1.6.0.jar:1.6.0]
16-Oct-2020 08:33:25             at org.junit.platform.engine.support.hierarchical.NodeTestTask.executeRecursively(NodeTestTask.java:122) ~[junit-platform-engine-1.6.0.jar:1.6.0]
16-Oct-2020 08:33:25             at org.junit.platform.engine.support.hierarchical.NodeTestTask.execute(NodeTestTask.java:80) ~[junit-platform-engine-1.6.0.jar:1.6.0]
16-Oct-2020 08:33:25             at org.junit.platform.engine.support.hierarchical.SameThreadHierarchicalTestExecutorService.submit(SameThreadHierarchicalTestExecutorService.java:32) ~[junit-platform-engine-1.6.0.jar:1.6.0]
16-Oct-2020 08:33:25             at org.junit.platform.engine.support.hierarchical.HierarchicalTestExecutor.execute(HierarchicalTestExecutor.java:57) ~[junit-platform-engine-1.6.0.jar:1.6.0]
16-Oct-2020 08:33:25             at org.junit.platform.engine.support.hierarchical.HierarchicalTestEngine.execute(HierarchicalTestEngine.java:51) ~[junit-platform-engine-1.6.0.jar:1.6.0]
16-Oct-2020 08:33:25             at org.junit.platform.launcher.core.DefaultLauncher.execute(DefaultLauncher.java:248) ~[na:na]
16-Oct-2020 08:33:25             at org.junit.platform.launcher.core.DefaultLauncher.lambda$execute$5(DefaultLauncher.java:211) ~[na:na]
16-Oct-2020 08:33:25             at org.junit.platform.launcher.core.DefaultLauncher.withInterceptedStreams(DefaultLauncher.java:226) ~[na:na]
16-Oct-2020 08:33:25             at org.junit.platform.launcher.core.DefaultLauncher.execute(DefaultLauncher.java:199) ~[na:na]
16-Oct-2020 08:33:25             at org.junit.platform.launcher.core.DefaultLauncher.execute(DefaultLauncher.java:132) ~[na:na]
16-Oct-2020 08:33:25             at org.gradle.api.internal.tasks.testing.junitplatform.JUnitPlatformTestClassProcessor$CollectAllTestClassesExecutor.processAllTestClasses(JUnitPlatformTestClassProcessor.java:99) ~[na:na]
16-Oct-2020 08:33:25             at org.gradle.api.internal.tasks.testing.junitplatform.JUnitPlatformTestClassProcessor$CollectAllTestClassesExecutor.access$000(JUnitPlatformTestClassProcessor.java:79) ~[na:na]
16-Oct-2020 08:33:25             at org.gradle.api.internal.tasks.testing.junitplatform.JUnitPlatformTestClassProcessor.stop(JUnitPlatformTestClassProcessor.java:75) ~[na:na]
16-Oct-2020 08:33:25             at org.gradle.api.internal.tasks.testing.SuiteTestClassProcessor.stop(SuiteTestClassProcessor.java:61) ~[na:na]
16-Oct-2020 08:33:25             at sun.reflect.NativeMethodAccessorImpl.invoke0(Native Method) ~[na:1.8.0_232]
16-Oct-2020 08:33:25             at sun.reflect.NativeMethodAccessorImpl.invoke(NativeMethodAccessorImpl.java:62) ~[na:1.8.0_232]
16-Oct-2020 08:33:25             at sun.reflect.DelegatingMethodAccessorImpl.invoke(DelegatingMethodAccessorImpl.java:43) ~[na:1.8.0_232]
16-Oct-2020 08:33:25             at java.lang.reflect.Method.invoke(Method.java:498) ~[na:1.8.0_232]
16-Oct-2020 08:33:25             at org.gradle.internal.dispatch.ReflectionDispatch.dispatch(ReflectionDispatch.java:36) ~[na:na]
16-Oct-2020 08:33:25             at org.gradle.internal.dispatch.ReflectionDispatch.dispatch(ReflectionDispatch.java:24) ~[na:na]
16-Oct-2020 08:33:25             at org.gradle.internal.dispatch.ContextClassLoaderDispatch.dispatch(ContextClassLoaderDispatch.java:33) ~[na:na]
16-Oct-2020 08:33:25             at org.gradle.internal.dispatch.ProxyDispatchAdapter$DispatchingInvocationHandler.invoke(ProxyDispatchAdapter.java:94) ~[na:na]
16-Oct-2020 08:33:25             at com.sun.proxy.$Proxy2.stop(Unknown Source) ~[na:na]
16-Oct-2020 08:33:25             at org.gradle.api.internal.tasks.testing.worker.TestWorker.stop(TestWorker.java:133) ~[na:na]
16-Oct-2020 08:33:25             at sun.reflect.NativeMethodAccessorImpl.invoke0(Native Method) ~[na:1.8.0_232]
16-Oct-2020 08:33:25             at sun.reflect.NativeMethodAccessorImpl.invoke(NativeMethodAccessorImpl.java:62) ~[na:1.8.0_232]
16-Oct-2020 08:33:25             at sun.reflect.DelegatingMethodAccessorImpl.invoke(DelegatingMethodAccessorImpl.java:43) ~[na:1.8.0_232]
16-Oct-2020 08:33:25             at java.lang.reflect.Method.invoke(Method.java:498) ~[na:1.8.0_232]
16-Oct-2020 08:33:25             at org.gradle.internal.dispatch.ReflectionDispatch.dispatch(ReflectionDispatch.java:36) ~[na:na]
16-Oct-2020 08:33:25             at org.gradle.internal.dispatch.ReflectionDispatch.dispatch(ReflectionDispatch.java:24) ~[na:na]
16-Oct-2020 08:33:25             at org.gradle.internal.remote.internal.hub.MessageHubBackedObjectConnection$DispatchWrapper.dispatch(MessageHubBackedObjectConnection.java:182) ~[na:na]
16-Oct-2020 08:33:25             at org.gradle.internal.remote.internal.hub.MessageHubBackedObjectConnection$DispatchWrapper.dispatch(MessageHubBackedObjectConnection.java:164) ~[na:na]
16-Oct-2020 08:33:25             at org.gradle.internal.remote.internal.hub.MessageHub$Handler.run(MessageHub.java:414) ~[na:na]
16-Oct-2020 08:33:25             at org.gradle.internal.concurrent.ExecutorPolicy$CatchAndRecordFailures.onExecute(ExecutorPolicy.java:64) ~[na:na]
16-Oct-2020 08:33:25             at org.gradle.internal.concurrent.ManagedExecutorImpl$1.run(ManagedExecutorImpl.java:48) ~[na:na]
16-Oct-2020 08:33:25             at java.util.concurrent.ThreadPoolExecutor.runWorker(ThreadPoolExecutor.java:1149) ~[na:1.8.0_232]
16-Oct-2020 08:33:25             at java.util.concurrent.ThreadPoolExecutor$Worker.run(ThreadPoolExecutor.java:624) ~[na:1.8.0_232]
16-Oct-2020 08:33:25             at org.gradle.internal.concurrent.ThreadFactoryImpl$ManagedThreadRunnable.run(ThreadFactoryImpl.java:56) ~[na:na]
16-Oct-2020 08:33:25             at java.lang.Thread.run(Thread.java:748) ~[na:1.8.0_232]
16-Oct-2020 08:33:25
16-Oct-2020 08:33:25 CommonPoolTest > [3] configAdjuster=MRU & FIFO PASSED
16-Oct-2020 08:33:25
16-Oct-2020 08:33:25 CommonPoolTest > [4] configAdjuster=MRU & LIFO STANDARD_OUT
16-Oct-2020 08:33:25     Oct 16 2020 08:33:25.227 [single-827] ERROR r.c.p.Operators [Loggers.java:319] - Operator called default onErrorDropped
16-Oct-2020 08:33:25     reactor.core.Exceptions$ErrorCallbackNotImplemented: reactor.pool.PoolAcquirePendingLimitException: Pending acquire queue has reached its maximum size of 1
16-Oct-2020 08:33:25     Caused by: reactor.pool.PoolAcquirePendingLimitException: Pending acquire queue has reached its maximum size of 1
16-Oct-2020 08:33:25             at reactor.pool.SimpleDequePool.pendingOffer(SimpleDequePool.java:455) [main/:na]
16-Oct-2020 08:33:25             at reactor.pool.SimpleDequePool.doAcquire(SimpleDequePool.java:255) [main/:na]
16-Oct-2020 08:33:25             at reactor.pool.AbstractPool$Borrower.request(AbstractPool.java:382) [main/:na]
16-Oct-2020 08:33:25             at reactor.core.publisher.FluxDoFinally$DoFinallySubscriber.request(FluxDoFinally.java:157) [reactor-core-3.4.0-SNAPSHOT.jar:3.4.0-SNAPSHOT]
16-Oct-2020 08:33:25             at reactor.core.publisher.MonoPeekTerminal$MonoTerminalPeekSubscriber.request(MonoPeekTerminal.java:139) [reactor-core-3.4.0-SNAPSHOT.jar:3.4.0-SNAPSHOT]
16-Oct-2020 08:33:25             at reactor.core.publisher.LambdaMonoSubscriber.onSubscribe(LambdaMonoSubscriber.java:121) [reactor-core-3.4.0-SNAPSHOT.jar:3.4.0-SNAPSHOT]
16-Oct-2020 08:33:25             at reactor.core.publisher.MonoPeekTerminal$MonoTerminalPeekSubscriber.onSubscribe(MonoPeekTerminal.java:152) [reactor-core-3.4.0-SNAPSHOT.jar:3.4.0-SNAPSHOT]
16-Oct-2020 08:33:25             at reactor.core.publisher.FluxDoFinally$DoFinallySubscriber.onSubscribe(FluxDoFinally.java:124) [reactor-core-3.4.0-SNAPSHOT.jar:3.4.0-SNAPSHOT]
16-Oct-2020 08:33:25             at reactor.pool.SimpleDequePool$QueueBorrowerMono.subscribe(SimpleDequePool.java:578) [main/:na]
16-Oct-2020 08:33:25             at reactor.core.publisher.Mono.subscribe(Mono.java:3987) [reactor-core-3.4.0-SNAPSHOT.jar:3.4.0-SNAPSHOT]
16-Oct-2020 08:33:25             at reactor.core.publisher.Mono.subscribeWith(Mono.java:4102) [reactor-core-3.4.0-SNAPSHOT.jar:3.4.0-SNAPSHOT]
16-Oct-2020 08:33:25             at reactor.core.publisher.Mono.subscribe(Mono.java:3819) [reactor-core-3.4.0-SNAPSHOT.jar:3.4.0-SNAPSHOT]
16-Oct-2020 08:33:25             at reactor.pool.CommonPoolTest.lambda$pendingLimitAsync$107(CommonPoolTest.java:977) [test/:na]
16-Oct-2020 08:33:25             at reactor.test.util.RaceTestUtils.lambda$race$2(RaceTestUtils.java:130) ~[reactor-test-3.4.0-SNAPSHOT.jar:3.4.0-SNAPSHOT]
16-Oct-2020 08:33:25             at reactor.core.scheduler.SchedulerTask.call(SchedulerTask.java:68) ~[reactor-core-3.4.0-SNAPSHOT.jar:3.4.0-SNAPSHOT]
16-Oct-2020 08:33:25             at reactor.core.scheduler.SchedulerTask.call(SchedulerTask.java:28) ~[reactor-core-3.4.0-SNAPSHOT.jar:3.4.0-SNAPSHOT]
16-Oct-2020 08:33:25             at java.util.concurrent.FutureTask.run(FutureTask.java:266) ~[na:1.8.0_232]
16-Oct-2020 08:33:25             at java.util.concurrent.ScheduledThreadPoolExecutor$ScheduledFutureTask.access$201(ScheduledThreadPoolExecutor.java:180) ~[na:1.8.0_232]
16-Oct-2020 08:33:25             at java.util.concurrent.ScheduledThreadPoolExecutor$ScheduledFutureTask.run(ScheduledThreadPoolExecutor.java:293) ~[na:1.8.0_232]
16-Oct-2020 08:33:25             at java.util.concurrent.ThreadPoolExecutor.runWorker(ThreadPoolExecutor.java:1149) ~[na:1.8.0_232]
16-Oct-2020 08:33:25             at java.util.concurrent.ThreadPoolExecutor$Worker.run(ThreadPoolExecutor.java:624) ~[na:1.8.0_232]
16-Oct-2020 08:33:25             at java.lang.Thread.run(Thread.java:748) ~[na:1.8.0_232]
16-Oct-2020 08:33:25
16-Oct-2020 08:33:25 CommonPoolTest > [4] configAdjuster=MRU & LIFO PASSED
16-Oct-2020 08:33:25
16-Oct-2020 08:33:25 CommonPoolTest > [1] configAdjuster=LRU & FIFO PASSED
16-Oct-2020 08:33:25
16-Oct-2020 08:33:25 CommonPoolTest > [2] configAdjuster=LRU & LIFO PASSED
16-Oct-2020 08:33:25
16-Oct-2020 08:33:25 CommonPoolTest > [3] configAdjuster=MRU & FIFO PASSED
16-Oct-2020 08:33:25
16-Oct-2020 08:33:25 CommonPoolTest > [4] configAdjuster=MRU & LIFO PASSED
16-Oct-2020 08:33:25
16-Oct-2020 08:33:25 CommonPoolTest > [1] configAdjuster=LRU & FIFO PASSED
16-Oct-2020 08:33:26
16-Oct-2020 08:33:26 CommonPoolTest > [2] configAdjuster=LRU & LIFO PASSED
16-Oct-2020 08:33:26
16-Oct-2020 08:33:26 CommonPoolTest > [3] configAdjuster=MRU & FIFO PASSED
16-Oct-2020 08:33:27
16-Oct-2020 08:33:27 CommonPoolTest > [4] configAdjuster=MRU & LIFO PASSED
16-Oct-2020 08:33:27
16-Oct-2020 08:33:27 CommonPoolTest > [1] configAdjuster=LRU & FIFO PASSED
16-Oct-2020 08:33:27
16-Oct-2020 08:33:27 CommonPoolTest > [2] configAdjuster=LRU & LIFO PASSED
16-Oct-2020 08:33:27
16-Oct-2020 08:33:27 CommonPoolTest > [3] configAdjuster=MRU & FIFO PASSED
16-Oct-2020 08:33:27
16-Oct-2020 08:33:27 CommonPoolTest > [4] configAdjuster=MRU & LIFO PASSED
16-Oct-2020 08:33:27
16-Oct-2020 08:33:27 CommonPoolTest > [1] configAdjuster=LRU & FIFO PASSED
16-Oct-2020 08:33:27
16-Oct-2020 08:33:27 CommonPoolTest > [2] configAdjuster=LRU & LIFO PASSED
16-Oct-2020 08:33:27
16-Oct-2020 08:33:27 CommonPoolTest > [3] configAdjuster=MRU & FIFO PASSED
16-Oct-2020 08:33:27
16-Oct-2020 08:33:27 CommonPoolTest > [4] configAdjuster=MRU & LIFO PASSED
16-Oct-2020 08:33:42
16-Oct-2020 08:33:42 CommonPoolTest > [1] configAdjuster=LRU & FIFO STANDARD_OUT
16-Oct-2020 08:33:42     Log in loop test, removed duplicated lines:
16-Oct-2020 08:33:42     [DEBUG] (Test worker) Using custom logging
16-Oct-2020 08:33:42     [DEBUG] (Test worker) should warm up 2 extra resources
16-Oct-2020 08:33:42     [DEBUG] (parallel-211) failed to warm up extra resource 2/2: java.lang.IllegalStateException: boom
16-Oct-2020 08:33:42     [DEBUG] (parallel-3) failed to warm up extra resource 1/2: java.lang.IllegalStateException: boom
16-Oct-2020 08:33:42     [DEBUG] (parallel-211) failed to warm up extra resource 1/2: java.lang.IllegalStateException: boom
16-Oct-2020 08:33:42     [DEBUG] (parallel-1) failed to warm up extra resource 2/2: java.lang.IllegalStateException: boom
16-Oct-2020 08:33:42     [DEBUG] (parallel-2) failed to warm up extra resource 2/2: java.lang.IllegalStateException: boom
16-Oct-2020 08:33:42     [DEBUG] (parallel-1) failed to warm up extra resource 1/2: java.lang.IllegalStateException: boom
16-Oct-2020 08:33:42     [DEBUG] (parallel-2) failed to warm up extra resource 1/2: java.lang.IllegalStateException: boom
16-Oct-2020 08:33:42     [DEBUG] (parallel-3) failed to warm up extra resource 2/2: java.lang.IllegalStateException: boom
16-Oct-2020 08:33:42     Oct 16 2020 08:33:42.530 [Test worker] DEBUG r.u.Loggers$LoggerFactory [Loggers.java:249] - Using Slf4j logging framework
16-Oct-2020 08:33:42
16-Oct-2020 08:33:42 CommonPoolTest > [1] configAdjuster=LRU & FIFO PASSED
16-Oct-2020 08:33:52
16-Oct-2020 08:33:52 CommonPoolTest > [2] configAdjuster=LRU & LIFO STANDARD_OUT
16-Oct-2020 08:33:52     Log in loop test, removed duplicated lines:
16-Oct-2020 08:33:52     [DEBUG] (Test worker) Using custom logging
16-Oct-2020 08:33:52     [DEBUG] (Test worker) should warm up 2 extra resources
16-Oct-2020 08:33:52     [DEBUG] (parallel-3) failed to warm up extra resource 1/2: java.lang.IllegalStateException: boom
16-Oct-2020 08:33:52     [DEBUG] (parallel-211) failed to warm up extra resource 2/2: java.lang.IllegalStateException: boom
16-Oct-2020 08:33:52     [DEBUG] (parallel-211) failed to warm up extra resource 1/2: java.lang.IllegalStateException: boom
16-Oct-2020 08:33:52     [DEBUG] (parallel-1) failed to warm up extra resource 2/2: java.lang.IllegalStateException: boom
16-Oct-2020 08:33:52     [DEBUG] (parallel-1) failed to warm up extra resource 1/2: java.lang.IllegalStateException: boom
16-Oct-2020 08:33:52     [DEBUG] (parallel-2) failed to warm up extra resource 2/2: java.lang.IllegalStateException: boom
16-Oct-2020 08:33:52     [DEBUG] (parallel-2) failed to warm up extra resource 1/2: java.lang.IllegalStateException: boom
16-Oct-2020 08:33:52     [DEBUG] (parallel-3) failed to warm up extra resource 2/2: java.lang.IllegalStateException: boom
16-Oct-2020 08:33:52     Oct 16 2020 08:33:52.611 [Test worker] DEBUG r.u.Loggers$LoggerFactory [Loggers.java:249] - Using Slf4j logging framework
16-Oct-2020 08:33:52
16-Oct-2020 08:33:52 CommonPoolTest > [2] configAdjuster=LRU & LIFO PASSED
16-Oct-2020 08:34:07
16-Oct-2020 08:34:07 CommonPoolTest > [3] configAdjuster=MRU & FIFO STANDARD_OUT
16-Oct-2020 08:34:07     Log in loop test, removed duplicated lines:
16-Oct-2020 08:34:07     [DEBUG] (Test worker) Using custom logging
16-Oct-2020 08:34:07     [DEBUG] (Test worker) should warm up 2 extra resources
16-Oct-2020 08:34:07     [DEBUG] (parallel-211) failed to warm up extra resource 1/2: java.lang.IllegalStateException: boom
16-Oct-2020 08:34:07     [DEBUG] (parallel-1) failed to warm up extra resource 2/2: java.lang.IllegalStateException: boom
16-Oct-2020 08:34:07     [DEBUG] (parallel-1) failed to warm up extra resource 1/2: java.lang.IllegalStateException: boom
16-Oct-2020 08:34:07     [DEBUG] (parallel-2) failed to warm up extra resource 2/2: java.lang.IllegalStateException: boom
16-Oct-2020 08:34:07     [DEBUG] (parallel-2) failed to warm up extra resource 1/2: java.lang.IllegalStateException: boom
16-Oct-2020 08:34:07     [DEBUG] (parallel-3) failed to warm up extra resource 2/2: java.lang.IllegalStateException: boom
16-Oct-2020 08:34:07     [DEBUG] (parallel-3) failed to warm up extra resource 1/2: java.lang.IllegalStateException: boom
16-Oct-2020 08:34:07     [DEBUG] (parallel-211) failed to warm up extra resource 2/2: java.lang.IllegalStateException: boom
16-Oct-2020 08:34:07     Oct 16 2020 08:34:07.672 [Test worker] DEBUG r.u.Loggers$LoggerFactory [Loggers.java:249] - Using Slf4j logging framework
16-Oct-2020 08:34:07
16-Oct-2020 08:34:07 CommonPoolTest > [3] configAdjuster=MRU & FIFO PASSED
16-Oct-2020 08:34:17
16-Oct-2020 08:34:17 CommonPoolTest > [4] configAdjuster=MRU & LIFO STANDARD_OUT
16-Oct-2020 08:34:17     Log in loop test, removed duplicated lines:
16-Oct-2020 08:34:17     [DEBUG] (Test worker) Using custom logging
16-Oct-2020 08:34:17     [DEBUG] (Test worker) should warm up 2 extra resources
16-Oct-2020 08:34:17     [DEBUG] (parallel-1) failed to warm up extra resource 2/2: java.lang.IllegalStateException: boom
16-Oct-2020 08:34:17     [DEBUG] (parallel-211) failed to warm up extra resource 1/2: java.lang.IllegalStateException: boom
16-Oct-2020 08:34:17     [DEBUG] (parallel-1) failed to warm up extra resource 1/2: java.lang.IllegalStateException: boom
16-Oct-2020 08:34:17     [DEBUG] (parallel-2) failed to warm up extra resource 2/2: java.lang.IllegalStateException: boom
16-Oct-2020 08:34:17     [DEBUG] (parallel-3) failed to warm up extra resource 2/2: java.lang.IllegalStateException: boom
16-Oct-2020 08:34:17     [DEBUG] (parallel-2) failed to warm up extra resource 1/2: java.lang.IllegalStateException: boom
16-Oct-2020 08:34:17     [DEBUG] (parallel-211) failed to warm up extra resource 2/2: java.lang.IllegalStateException: boom
16-Oct-2020 08:34:17     [DEBUG] (parallel-3) failed to warm up extra resource 1/2: java.lang.IllegalStateException: boom
16-Oct-2020 08:34:17     [DEBUG] (parallel-1) should warm up 1 extra resources
16-Oct-2020 08:34:17     [DEBUG] (parallel-1) failed to warm up extra resource 1/1: java.lang.IllegalStateException: boom
16-Oct-2020 08:34:17     Oct 16 2020 08:34:17.745 [Test worker] DEBUG r.u.Loggers$LoggerFactory [Loggers.java:249] - Using Slf4j logging framework
16-Oct-2020 08:34:17
16-Oct-2020 08:34:17 CommonPoolTest > [4] configAdjuster=MRU & LIFO PASSED
16-Oct-2020 08:34:18
16-Oct-2020 08:34:18 CommonPoolTest > [1] configAdjuster=LRU & FIFO PASSED
16-Oct-2020 08:34:18
16-Oct-2020 08:34:18 CommonPoolTest > [2] configAdjuster=LRU & LIFO PASSED
16-Oct-2020 08:34:18
16-Oct-2020 08:34:18 CommonPoolTest > [3] configAdjuster=MRU & FIFO PASSED
16-Oct-2020 08:34:19
16-Oct-2020 08:34:19 CommonPoolTest > [4] configAdjuster=MRU & LIFO PASSED
16-Oct-2020 08:34:21
16-Oct-2020 08:34:21 CommonPoolTest > [1] configAdjuster=LRU & FIFO PASSED
16-Oct-2020 08:34:23
16-Oct-2020 08:34:23 CommonPoolTest > [2] configAdjuster=MRU & FIFO PASSED
16-Oct-2020 08:34:25
16-Oct-2020 08:34:25 CommonPoolTest > [1] configAdjuster=LRU & LIFO PASSED
16-Oct-2020 08:34:27
16-Oct-2020 08:34:27 CommonPoolTest > [2] configAdjuster=MRU & LIFO PASSED
16-Oct-2020 08:34:27
16-Oct-2020 08:34:27 CommonPoolTest > [1] configAdjuster=LRU & FIFO STANDARD_OUT
16-Oct-2020 08:34:27     Oct 16 2020 08:34:26.982 [Test worker] DEBUG r.p.SimpleDequePool [Loggers.java:254] - should warm up 3 extra resources
16-Oct-2020 08:34:27     Oct 16 2020 08:34:26.982 [Test worker] DEBUG r.p.SimpleDequePool [Loggers.java:254] - warmed up extra resource 1/3
16-Oct-2020 08:34:27     Oct 16 2020 08:34:26.983 [Test worker] DEBUG r.p.SimpleDequePool [Loggers.java:254] - warmed up extra resource 2/3
16-Oct-2020 08:34:27     Oct 16 2020 08:34:26.983 [Test worker] DEBUG r.p.SimpleDequePool [Loggers.java:254] - warmed up extra resource 3/3
16-Oct-2020 08:34:27
16-Oct-2020 08:34:27 CommonPoolTest > [1] configAdjuster=LRU & FIFO PASSED
16-Oct-2020 08:34:27
16-Oct-2020 08:34:27 CommonPoolTest > [2] configAdjuster=LRU & LIFO STANDARD_OUT
16-Oct-2020 08:34:27     Oct 16 2020 08:34:27.084 [Test worker] DEBUG r.p.SimpleDequePool [Loggers.java:254] - should warm up 3 extra resources
16-Oct-2020 08:34:27     Oct 16 2020 08:34:27.085 [Test worker] DEBUG r.p.SimpleDequePool [Loggers.java:254] - warmed up extra resource 1/3
16-Oct-2020 08:34:27     Oct 16 2020 08:34:27.085 [Test worker] DEBUG r.p.SimpleDequePool [Loggers.java:254] - warmed up extra resource 2/3
16-Oct-2020 08:34:27     Oct 16 2020 08:34:27.085 [Test worker] DEBUG r.p.SimpleDequePool [Loggers.java:254] - warmed up extra resource 3/3
16-Oct-2020 08:34:27
16-Oct-2020 08:34:27 CommonPoolTest > [2] configAdjuster=LRU & LIFO PASSED
16-Oct-2020 08:34:27
16-Oct-2020 08:34:27 CommonPoolTest > [3] configAdjuster=MRU & FIFO STANDARD_OUT
16-Oct-2020 08:34:27     Oct 16 2020 08:34:27.187 [Test worker] DEBUG r.p.SimpleDequePool [Loggers.java:254] - should warm up 3 extra resources
16-Oct-2020 08:34:27     Oct 16 2020 08:34:27.187 [Test worker] DEBUG r.p.SimpleDequePool [Loggers.java:254] - warmed up extra resource 1/3
16-Oct-2020 08:34:27     Oct 16 2020 08:34:27.187 [Test worker] DEBUG r.p.SimpleDequePool [Loggers.java:254] - warmed up extra resource 2/3
16-Oct-2020 08:34:27     Oct 16 2020 08:34:27.188 [Test worker] DEBUG r.p.SimpleDequePool [Loggers.java:254] - warmed up extra resource 3/3
16-Oct-2020 08:34:27
16-Oct-2020 08:34:27 CommonPoolTest > [3] configAdjuster=MRU & FIFO PASSED
16-Oct-2020 08:34:27
16-Oct-2020 08:34:27 CommonPoolTest > [4] configAdjuster=MRU & LIFO STANDARD_OUT
16-Oct-2020 08:34:27     Oct 16 2020 08:34:27.289 [Test worker] DEBUG r.p.SimpleDequePool [Loggers.java:254] - should warm up 3 extra resources
16-Oct-2020 08:34:27     Oct 16 2020 08:34:27.289 [Test worker] DEBUG r.p.SimpleDequePool [Loggers.java:254] - warmed up extra resource 1/3
16-Oct-2020 08:34:27     Oct 16 2020 08:34:27.290 [Test worker] DEBUG r.p.SimpleDequePool [Loggers.java:254] - warmed up extra resource 2/3
16-Oct-2020 08:34:27     Oct 16 2020 08:34:27.290 [Test worker] DEBUG r.p.SimpleDequePool [Loggers.java:254] - warmed up extra resource 3/3
16-Oct-2020 08:34:27
16-Oct-2020 08:34:27 CommonPoolTest > [4] configAdjuster=MRU & LIFO PASSED
16-Oct-2020 08:34:30
16-Oct-2020 08:34:30 CommonPoolTest > [1] configAdjuster=LRU & FIFO PASSED
16-Oct-2020 08:34:32
16-Oct-2020 08:34:32 CommonPoolTest > [2] configAdjuster=LRU & LIFO PASSED
16-Oct-2020 08:34:35
16-Oct-2020 08:34:35 CommonPoolTest > [3] configAdjuster=MRU & FIFO PASSED
16-Oct-2020 08:34:37
16-Oct-2020 08:34:37 CommonPoolTest > [4] configAdjuster=MRU & LIFO PASSED
16-Oct-2020 08:34:37
16-Oct-2020 08:34:37 CommonPoolTest > [1] configAdjuster=LRU & FIFO PASSED
16-Oct-2020 08:34:37
16-Oct-2020 08:34:37 CommonPoolTest > [2] configAdjuster=LRU & LIFO PASSED
16-Oct-2020 08:34:37
16-Oct-2020 08:34:37 CommonPoolTest > [3] configAdjuster=MRU & FIFO PASSED
16-Oct-2020 08:34:37
16-Oct-2020 08:34:37 CommonPoolTest > [4] configAdjuster=MRU & LIFO PASSED
16-Oct-2020 08:34:38
16-Oct-2020 08:34:38 CommonPoolTest > [1] configAdjuster=LRU & FIFO PASSED
16-Oct-2020 08:34:38
16-Oct-2020 08:34:38 CommonPoolTest > [2] configAdjuster=LRU & LIFO PASSED
16-Oct-2020 08:34:39
16-Oct-2020 08:34:39 CommonPoolTest > [3] configAdjuster=MRU & FIFO PASSED
16-Oct-2020 08:34:39
16-Oct-2020 08:34:39 CommonPoolTest > [4] configAdjuster=MRU & LIFO PASSED
16-Oct-2020 08:34:39
16-Oct-2020 08:34:39 CommonPoolTest > [1] configAdjuster=LRU & FIFO PASSED
16-Oct-2020 08:34:39
16-Oct-2020 08:34:39 CommonPoolTest > [2] configAdjuster=LRU & LIFO PASSED
16-Oct-2020 08:34:39
16-Oct-2020 08:34:39 CommonPoolTest > [3] configAdjuster=MRU & FIFO PASSED
16-Oct-2020 08:34:39
16-Oct-2020 08:34:39 CommonPoolTest > [4] configAdjuster=MRU & LIFO PASSED
16-Oct-2020 08:34:39
16-Oct-2020 08:34:39 CommonPoolTest > [1] configAdjuster=LRU & FIFO PASSED
16-Oct-2020 08:34:39
16-Oct-2020 08:34:39 CommonPoolTest > [2] configAdjuster=LRU & LIFO PASSED
16-Oct-2020 08:34:39
16-Oct-2020 08:34:39 CommonPoolTest > [3] configAdjuster=MRU & FIFO PASSED
16-Oct-2020 08:34:39
16-Oct-2020 08:34:39 CommonPoolTest > [4] configAdjuster=MRU & LIFO PASSED
16-Oct-2020 08:34:39
16-Oct-2020 08:34:39 CommonPoolTest > [1] configAdjuster=LRU & FIFO PASSED
16-Oct-2020 08:34:39
16-Oct-2020 08:34:39 CommonPoolTest > [2] configAdjuster=LRU & LIFO PASSED
16-Oct-2020 08:34:39
16-Oct-2020 08:34:39 CommonPoolTest > [3] configAdjuster=MRU & FIFO PASSED
16-Oct-2020 08:34:39
16-Oct-2020 08:34:39 CommonPoolTest > [4] configAdjuster=MRU & LIFO PASSED
16-Oct-2020 08:34:39
16-Oct-2020 08:34:39 CommonPoolTest > [1] configAdjuster=LRU & FIFO PASSED
16-Oct-2020 08:34:39
16-Oct-2020 08:34:39 CommonPoolTest > [2] configAdjuster=LRU & LIFO PASSED
16-Oct-2020 08:34:39
16-Oct-2020 08:34:39 CommonPoolTest > [3] configAdjuster=MRU & FIFO PASSED
16-Oct-2020 08:34:39
16-Oct-2020 08:34:39 CommonPoolTest > [4] configAdjuster=MRU & LIFO PASSED
16-Oct-2020 08:34:39
16-Oct-2020 08:34:39 CommonPoolTest > [1] configAdjuster=LRU & FIFO STANDARD_OUT
16-Oct-2020 08:34:39     Oct 16 2020 08:34:39.745 [Test worker] DEBUG r.p.SimpleDequePool [Loggers.java:254] - should warm up 2 extra resources
16-Oct-2020 08:34:39     Oct 16 2020 08:34:39.846 [parallel-3] DEBUG r.p.SimpleDequePool [Loggers.java:254] - failed to warm up extra resource 1/2: java.lang.IllegalStateException: boom
16-Oct-2020 08:34:39     Oct 16 2020 08:34:39.847 [parallel-211] DEBUG r.p.SimpleDequePool [Loggers.java:254] - failed to warm up extra resource 2/2: java.lang.IllegalStateException: boom
16-Oct-2020 08:34:39
16-Oct-2020 08:34:39 CommonPoolTest > [1] configAdjuster=LRU & FIFO PASSED
16-Oct-2020 08:34:39
16-Oct-2020 08:34:39 CommonPoolTest > [2] configAdjuster=LRU & LIFO STANDARD_OUT
16-Oct-2020 08:34:39     Oct 16 2020 08:34:39.898 [Test worker] DEBUG r.p.SimpleDequePool [Loggers.java:254] - should warm up 2 extra resources
16-Oct-2020 08:34:40
16-Oct-2020 08:34:40 CommonPoolTest > [2] configAdjuster=LRU & LIFO PASSED
16-Oct-2020 08:34:40
16-Oct-2020 08:34:40 CommonPoolTest STANDARD_OUT
16-Oct-2020 08:34:40     Oct 16 2020 08:34:40.005 [parallel-211] DEBUG r.p.SimpleDequePool [Loggers.java:254] - failed to warm up extra resource 1/2: java.lang.IllegalStateException: boom
16-Oct-2020 08:34:40     Oct 16 2020 08:34:40.005 [parallel-1] DEBUG r.p.SimpleDequePool [Loggers.java:254] - failed to warm up extra resource 2/2: java.lang.IllegalStateException: boom
16-Oct-2020 08:34:40
16-Oct-2020 08:34:40 CommonPoolTest > [3] configAdjuster=MRU & FIFO STANDARD_OUT
16-Oct-2020 08:34:40     Oct 16 2020 08:34:40.007 [Test worker] DEBUG r.p.SimpleDequePool [Loggers.java:254] - should warm up 2 extra resources
16-Oct-2020 08:34:40     Oct 16 2020 08:34:40.108 [parallel-1] DEBUG r.p.SimpleDequePool [Loggers.java:254] - failed to warm up extra resource 2/2: java.lang.IllegalStateException: boom
16-Oct-2020 08:34:40     Oct 16 2020 08:34:40.108 [parallel-211] DEBUG r.p.SimpleDequePool [Loggers.java:254] - failed to warm up extra resource 1/2: java.lang.IllegalStateException: boom
16-Oct-2020 08:34:40
16-Oct-2020 08:34:40 CommonPoolTest > [3] configAdjuster=MRU & FIFO PASSED
16-Oct-2020 08:34:40
16-Oct-2020 08:34:40 CommonPoolTest > [4] configAdjuster=MRU & LIFO STANDARD_OUT
16-Oct-2020 08:34:40     Oct 16 2020 08:34:40.159 [Test worker] DEBUG r.p.SimpleDequePool [Loggers.java:254] - should warm up 2 extra resources
16-Oct-2020 08:34:40
16-Oct-2020 08:34:40 CommonPoolTest > [4] configAdjuster=MRU & LIFO PASSED
16-Oct-2020 08:34:40
16-Oct-2020 08:34:40 CommonPoolTest STANDARD_OUT
16-Oct-2020 08:34:40     Oct 16 2020 08:34:40.259 [parallel-2] DEBUG r.p.SimpleDequePool [Loggers.java:254] - failed to warm up extra resource 2/2: java.lang.IllegalStateException: boom
16-Oct-2020 08:34:40     Oct 16 2020 08:34:40.260 [parallel-1] DEBUG r.p.SimpleDequePool [Loggers.java:254] - failed to warm up extra resource 1/2: java.lang.IllegalStateException: boom
16-Oct-2020 08:34:40
16-Oct-2020 08:34:40 CommonPoolTest > [1] configAdjuster=LRU & FIFO PASSED
16-Oct-2020 08:34:41
16-Oct-2020 08:34:41 CommonPoolTest > [2] configAdjuster=LRU & LIFO PASSED
16-Oct-2020 08:34:41
16-Oct-2020 08:34:41 CommonPoolTest > [3] configAdjuster=MRU & FIFO PASSED
16-Oct-2020 08:34:42
16-Oct-2020 08:34:42 CommonPoolTest > [4] configAdjuster=MRU & LIFO PASSED
16-Oct-2020 08:34:57
16-Oct-2020 08:34:57 PendingAcquireLifoBehaviorTest > consistentThreadDeliveringWhenNoElementsAndFullAndRaceDrainWithPoolable_loop() PASSED
16-Oct-2020 08:34:57
16-Oct-2020 08:34:57 PendingAcquireLifoBehaviorTest > consistentThreadDeliveringWhenNoElementsAndFullAndRaceDrain() PASSED
16-Oct-2020 08:34:57
16-Oct-2020 08:34:57 PendingAcquireLifoBehaviorTest > stillacquiredAfterPoolDisposedMaintainsCount() STANDARD_OUT
16-Oct-2020 08:34:57     Oct 16 2020 08:34:57.273 [Test worker] DEBUG r.p.SimpleDequePool [Loggers.java:254] - should warm up 2 extra resources
16-Oct-2020 08:34:57     Oct 16 2020 08:34:57.273 [Test worker] DEBUG r.p.SimpleDequePool [Loggers.java:254] - warmed up extra resource 1/2
16-Oct-2020 08:34:57     Oct 16 2020 08:34:57.274 [Test worker] DEBUG r.p.SimpleDequePool [Loggers.java:254] - warmed up extra resource 2/2
16-Oct-2020 08:34:57
16-Oct-2020 08:34:57 PendingAcquireLifoBehaviorTest > stillacquiredAfterPoolDisposedMaintainsCount() PASSED
16-Oct-2020 08:34:57
16-Oct-2020 08:34:57 PendingAcquireLifoBehaviorTest > [1] parallelism=4, loops=1 PASSED
16-Oct-2020 08:34:59
16-Oct-2020 08:34:59 PendingAcquireLifoBehaviorTest > [2] parallelism=4, loops=100000 PASSED
16-Oct-2020 08:34:59
16-Oct-2020 08:34:59 PendingAcquireLifoBehaviorTest > [3] parallelism=10, loops=1 PASSED
16-Oct-2020 08:35:04
16-Oct-2020 08:35:04 PendingAcquireLifoBehaviorTest > [4] parallelism=10, loops=100000 PASSED
16-Oct-2020 08:35:18
16-Oct-2020 08:35:18 PendingAcquireLifoBehaviorTest > consistentThreadDeliveringWhenNoElementsAndFullAndRaceDrain_loop() PASSED
16-Oct-2020 08:35:18
16-Oct-2020 08:35:18 PendingAcquireLifoBehaviorTest > consistentThreadDeliveringWhenNoElementsAndFullAndRaceDrainWithPoolable() PASSED
16-Oct-2020 08:35:19
16-Oct-2020 08:35:19 > Task :jacocoTestReport
16-Oct-2020 08:35:19
16-Oct-2020 08:35:19 > Task :downloadBaseline
16-Oct-2020 08:35:19 Unable to get progress logger. Download progress will not be displayed.
16-Oct-2020 08:35:20
16-Oct-2020 08:35:20 > Task :jar
16-Oct-2020 08:35:20 > Task :compileJcstressJava
16-Oct-2020 08:35:20 > Task :processJcstressResources NO-SOURCE
16-Oct-2020 08:35:20 > Task :jcstressClasses
16-Oct-2020 08:35:20 > Task :jcstressJar
16-Oct-2020 08:35:21 > Task :japicmp
16-Oct-2020 08:35:22
16-Oct-2020 08:35:22 > Task :jcstress
16-Oct-2020 08:35:22 Java Concurrency Stress Tests
16-Oct-2020 08:35:22 ---------------------------------------------------------------------------------
16-Oct-2020 08:35:22 Rev: 3c94746a6abf, built by shade with 11-internal at 2018-11-27T16:27:22Z
16-Oct-2020 08:35:22
16-Oct-2020 08:35:22 Probing what VM modes are available:
16-Oct-2020 08:35:22 (failures are non-fatal, but may miss some interesting cases)
16-Oct-2020 08:35:22
16-Oct-2020 08:35:22 ----- [OK] [-Xint]
16-Oct-2020 08:35:22 ----- [OK] [-XX:TieredStopAtLevel=1]
16-Oct-2020 08:35:22 ----- [OK] []
16-Oct-2020 08:35:22 ----- [N/A] [-XX:+UnlockDiagnosticVMOptions, -XX:+StressLCM, -XX:+StressGCM]
16-Oct-2020 08:35:22 Error: VM option 'StressLCM' is develop and is available only in debug version of VM.
16-Oct-2020 08:35:22 Error: Could not create the Java Virtual Machine.
16-Oct-2020 08:35:22 Error: A fatal exception has occurred. Program will exit.
16-Oct-2020 08:35:22
16-Oct-2020 08:35:22
16-Oct-2020 08:35:22 ----- [OK] [-XX:-TieredCompilation]
16-Oct-2020 08:35:22 ----- [N/A] [-XX:-TieredCompilation, -XX:+UnlockDiagnosticVMOptions, -XX:+StressLCM, -XX:+StressGCM]
16-Oct-2020 08:35:22 Error: VM option 'StressLCM' is develop and is available only in debug version of VM.
16-Oct-2020 08:35:22 Error: Could not create the Java Virtual Machine.
16-Oct-2020 08:35:22 Error: A fatal exception has occurred. Program will exit.
16-Oct-2020 08:35:22
16-Oct-2020 08:35:22
16-Oct-2020 08:35:22
16-Oct-2020 08:35:22 Initializing and probing the target VM:
16-Oct-2020 08:35:22 (all failures are non-fatal, but may affect testing accuracy)
16-Oct-2020 08:35:22
16-Oct-2020 08:35:22 ----- [OK] Unlocking diagnostic VM options
16-Oct-2020 08:35:22 Burning up to figure out the exact CPU count....... done!
16-Oct-2020 08:35:22
16-Oct-2020 08:35:22 ----- [OK] Trimming down the default VM heap size to 1/4-th of max RAM
16-Oct-2020 08:35:22 ----- [OK] Trimming down the number of compiler threads
16-Oct-2020 08:35:22 ----- [OK] Trimming down the number of parallel GC threads
16-Oct-2020 08:35:22 ----- [OK] Trimming down the number of concurrent GC threads
16-Oct-2020 08:35:22 ----- [OK] Trimming down the number of G1 concurrent refinement GC threads
16-Oct-2020 08:35:23 ----- [OK] Testing @Contended works on all results and infra objects
16-Oct-2020 08:35:23 ----- [OK] Unlocking Whitebox API for online de-optimization
16-Oct-2020 08:35:23 ----- [OK] Testing allocation profiling
16-Oct-2020 08:35:23 ----- [FAILED] Trying Thread.onSpinWait
16-Oct-2020 08:35:23 Exception in thread "main" java.lang.NoSuchMethodError: java.lang.Thread.onSpinWait()V
16-Oct-2020 08:35:23         at org.openjdk.jcstress.vm.ThreadSpinWaitTestMain.main(ThreadSpinWaitTestMain.java:30)
16-Oct-2020 08:35:23
16-Oct-2020 08:35:23
16-Oct-2020 08:35:23   Hardware threads in use/available: 4/4, no yielding.
16-Oct-2020 08:35:23   Test preset mode: "default"
16-Oct-2020 08:35:23   Writing the test results to "jcstress-results-2020-10-16-08-35-20.bin.gz"
16-Oct-2020 08:35:23   Parsing results to "/opt/bamboo-home/xml-data/build-dir/REACTOR-RPOOL-JOB1/build/reports/jcstress/"
16-Oct-2020 08:35:23   Running each test matching ".*" for 1 forks, 5 iterations, 1000 ms each
16-Oct-2020 08:35:23   Each JVM would execute at most 5 tests in the row.
16-Oct-2020 08:35:23   Solo stride size will be autobalanced within [10, 10000] elements, but taking no more than 100 Mb.
16-Oct-2020 08:35:23
16-Oct-2020 08:35:24
16-Oct-2020 08:35:24
16-Oct-2020 08:35:24       [OK] reactor.pool.SimpleDequePoolStressTest.MaxPendingAcquireWhileDestroying
16-Oct-2020 08:35:25 (ETA:   00:00:00) (Rate: 4.04E+07 samples/sec) (Tests: 1 of 2) (Forks:  1 of 8) (Iterations:  1 of 48; 1 passed, 0 failed, 0 soft errs, 0 hard errs)
16-Oct-2020 08:35:25                                                                                                                                                      
16-Oct-2020 08:35:25       [OK] reactor.pool.SimpleDequePoolStressTest.MaxPendingAcquireWhileDestroying
16-Oct-2020 08:35:25 (ETA:   00:00:15) (Rate: 9.75E+05 samples/sec) (Tests: 1 of 2) (Forks:  2 of 8) (Iterations:  2 of 48; 2 passed, 0 failed, 0 soft errs, 0 hard errs)
16-Oct-2020 08:35:25                                                                                                                                                      
16-Oct-2020 08:35:25       [OK] reactor.pool.SimpleDequePoolStressTest.MaxPendingAcquireWhileDestroying
16-Oct-2020 08:35:26 (ETA:   00:00:15) (Rate: 1.21E+06 samples/sec) (Tests: 1 of 2) (Forks:  2 of 8) (Iterations:  3 of 48; 3 passed, 0 failed, 0 soft errs, 0 hard errs)
16-Oct-2020 08:35:26                                                                                                                                                      
16-Oct-2020 08:35:26       [OK] reactor.pool.SimpleDequePoolStressTest.MaxPendingAcquireWhileDestroying
16-Oct-2020 08:35:27 (ETA:   00:00:18) (Rate: 9.36E+05 samples/sec) (Tests: 1 of 2) (Forks:  2 of 8) (Iterations:  4 of 48; 4 passed, 0 failed, 0 soft errs, 0 hard errs)
16-Oct-2020 08:35:27                                                                                                                                                      
16-Oct-2020 08:35:27       [OK] reactor.pool.SimpleDequePoolStressTest.MaxPendingAcquireWhileDestroying
16-Oct-2020 08:35:27 (ETA:   00:00:17) (Rate: 1.03E+06 samples/sec) (Tests: 1 of 2) (Forks:  2 of 8) (Iterations:  5 of 48; 5 passed, 0 failed, 0 soft errs, 0 hard errs)
16-Oct-2020 08:35:27                                                                                                                                                      
16-Oct-2020 08:35:27       [OK] reactor.pool.SimpleDequePoolStressTest.MaxPendingAcquireWhileDestroying
16-Oct-2020 08:35:28 (ETA:   00:00:18) (Rate: 9.25E+05 samples/sec) (Tests: 1 of 2) (Forks:  2 of 8) (Iterations:  6 of 48; 6 passed, 0 failed, 0 soft errs, 0 hard errs)
16-Oct-2020 08:35:28                                                                                                                                                      
16-Oct-2020 08:35:28       [OK] reactor.pool.SimpleDequePoolStressTest.MaxPendingAcquireWhileDestroying
16-Oct-2020 08:35:28 (ETA:   00:00:17) (Rate: 1.04E+06 samples/sec) (Tests: 1 of 2) (Forks:  2 of 8) (Iterations:  7 of 48; 7 passed, 0 failed, 0 soft errs, 0 hard errs)
16-Oct-2020 08:35:28                                                                                                                                                      
16-Oct-2020 08:35:28       [OK] reactor.pool.SimpleDequePoolStressTest.MaxPendingAcquireWhileDestroying
16-Oct-2020 08:35:29 (ETA:   00:00:17) (Rate: 9.57E+05 samples/sec) (Tests: 1 of 2) (Forks:  2 of 8) (Iterations:  8 of 48; 8 passed, 0 failed, 0 soft errs, 0 hard errs)
16-Oct-2020 08:35:29                                                                                                                                                      
16-Oct-2020 08:35:29       [OK] reactor.pool.SimpleDequePoolStressTest.MaxPendingAcquireWhileDestroying
16-Oct-2020 08:35:29 (ETA:   00:00:17) (Rate: 1.03E+06 samples/sec) (Tests: 1 of 2) (Forks:  2 of 8) (Iterations:  9 of 48; 9 passed, 0 failed, 0 soft errs, 0 hard errs)
16-Oct-2020 08:35:29                                                                                                                                                      
16-Oct-2020 08:35:29       [OK] reactor.pool.SimpleDequePoolStressTest.MaxPendingAcquireWhileDestroying
16-Oct-2020 08:35:30 (ETA:   00:00:17) (Rate: 9.73E+05 samples/sec) (Tests: 1 of 2) (Forks:  2 of 8) (Iterations: 10 of 48; 10 passed, 0 failed, 0 soft errs, 0 hard errs)
16-Oct-2020 08:35:30                                                                                                                                                      
16-Oct-2020 08:35:30       [OK] reactor.pool.SimpleDequePoolStressTest.MaxPendingAcquireWhileDestroying
16-Oct-2020 08:35:30 (ETA:   00:00:16) (Rate: 1.04E+06 samples/sec) (Tests: 1 of 2) (Forks:  2 of 8) (Iterations: 11 of 48; 11 passed, 0 failed, 0 soft errs, 0 hard errs)
16-Oct-2020 08:35:30                                                                                                                                                      
16-Oct-2020 08:35:30       [OK] reactor.pool.SimpleDequePoolStressTest.MaxPendingAcquireWhileDestroying
16-Oct-2020 08:35:30 (ETA:   00:00:16) (Rate: 9.87E+05 samples/sec) (Tests: 1 of 2) (Forks:  2 of 8) (Iterations: 12 of 48; 12 passed, 0 failed, 0 soft errs, 0 hard errs)
16-Oct-2020 08:35:30                                                                                                                                                      
16-Oct-2020 08:35:30       [OK] reactor.pool.SimpleDequePoolStressTest.BackgroundEvictionVsAcquire
16-Oct-2020 08:35:31 (ETA:   00:00:15) (Rate: 1.01E+06 samples/sec) (Tests: 2 of 2) (Forks:  3 of 8) (Iterations: 13 of 48; 13 passed, 0 failed, 0 soft errs, 0 hard errs)
16-Oct-2020 08:35:31                                                                                                                                                      
16-Oct-2020 08:35:31       [OK] reactor.pool.SimpleDequePoolStressTest.BackgroundEvictionVsAcquire
16-Oct-2020 08:35:32 (ETA:   00:00:16) (Rate: 9.40E+05 samples/sec) (Tests: 2 of 2) (Forks:  3 of 8) (Iterations: 14 of 48; 14 passed, 0 failed, 0 soft errs, 0 hard errs)
16-Oct-2020 08:35:32                                                                                                                                                      
16-Oct-2020 08:35:32       [OK] reactor.pool.SimpleDequePoolStressTest.BackgroundEvictionVsAcquire
16-Oct-2020 08:35:32 (ETA:   00:00:15) (Rate: 9.65E+05 samples/sec) (Tests: 2 of 2) (Forks:  4 of 8) (Iterations: 15 of 48; 15 passed, 0 failed, 0 soft errs, 0 hard errs)
16-Oct-2020 08:35:32                                                                                                                                                      
16-Oct-2020 08:35:32       [OK] reactor.pool.SimpleDequePoolStressTest.BackgroundEvictionVsAcquire
16-Oct-2020 08:35:33 (ETA:   00:00:15) (Rate: 9.35E+05 samples/sec) (Tests: 2 of 2) (Forks:  4 of 8) (Iterations: 16 of 48; 16 passed, 0 failed, 0 soft errs, 0 hard errs)
16-Oct-2020 08:35:33                                                                                                                                                      
16-Oct-2020 08:35:33       [OK] reactor.pool.SimpleDequePoolStressTest.BackgroundEvictionVsAcquire
16-Oct-2020 08:35:33 (ETA:   00:00:14) (Rate: 9.47E+05 samples/sec) (Tests: 2 of 2) (Forks:  4 of 8) (Iterations: 17 of 48; 17 passed, 0 failed, 0 soft errs, 0 hard errs)
16-Oct-2020 08:35:33                                                                                                                                                      
16-Oct-2020 08:35:33       [OK] reactor.pool.SimpleDequePoolStressTest.BackgroundEvictionVsAcquire
16-Oct-2020 08:35:34 (ETA:   00:00:14) (Rate: 9.16E+05 samples/sec) (Tests: 2 of 2) (Forks:  4 of 8) (Iterations: 18 of 48; 18 passed, 0 failed, 0 soft errs, 0 hard errs)
16-Oct-2020 08:35:34                                                                                                                                                      
16-Oct-2020 08:35:34       [OK] reactor.pool.SimpleDequePoolStressTest.BackgroundEvictionVsAcquire
16-Oct-2020 08:35:34 (ETA:   00:00:13) (Rate: 9.30E+05 samples/sec) (Tests: 2 of 2) (Forks:  4 of 8) (Iterations: 19 of 48; 19 passed, 0 failed, 0 soft errs, 0 hard errs)
16-Oct-2020 08:35:34                                                                                                                                                      
16-Oct-2020 08:35:34       [OK] reactor.pool.SimpleDequePoolStressTest.BackgroundEvictionVsAcquire
16-Oct-2020 08:35:35 (ETA:   00:00:13) (Rate: 9.16E+05 samples/sec) (Tests: 2 of 2) (Forks:  4 of 8) (Iterations: 20 of 48; 20 passed, 0 failed, 0 soft errs, 0 hard errs)
16-Oct-2020 08:35:35                                                                                                                                                      
16-Oct-2020 08:35:35       [OK] reactor.pool.SimpleDequePoolStressTest.BackgroundEvictionVsAcquire
16-Oct-2020 08:35:35 (ETA:   00:00:12) (Rate: 9.29E+05 samples/sec) (Tests: 2 of 2) (Forks:  4 of 8) (Iterations: 21 of 48; 21 passed, 0 failed, 0 soft errs, 0 hard errs)
16-Oct-2020 08:35:35                                                                                                                                                      
16-Oct-2020 08:35:35       [OK] reactor.pool.SimpleDequePoolStressTest.BackgroundEvictionVsAcquire
16-Oct-2020 08:35:36 (ETA:   00:00:12) (Rate: 9.14E+05 samples/sec) (Tests: 2 of 2) (Forks:  4 of 8) (Iterations: 22 of 48; 22 passed, 0 failed, 0 soft errs, 0 hard errs)
16-Oct-2020 08:35:36                                                                                                                                                      
16-Oct-2020 08:35:36       [OK] reactor.pool.SimpleDequePoolStressTest.BackgroundEvictionVsAcquire
16-Oct-2020 08:35:37 (ETA:   00:00:11) (Rate: 9.28E+05 samples/sec) (Tests: 2 of 2) (Forks:  4 of 8) (Iterations: 23 of 48; 23 passed, 0 failed, 0 soft errs, 0 hard errs)
16-Oct-2020 08:35:37                                                                                                                                                      
16-Oct-2020 08:35:37       [OK] reactor.pool.SimpleDequePoolStressTest.BackgroundEvictionVsAcquire
16-Oct-2020 08:35:38 (ETA:   00:00:11) (Rate: 8.77E+05 samples/sec) (Tests: 2 of 2) (Forks:  4 of 8) (Iterations: 24 of 48; 24 passed, 0 failed, 0 soft errs, 0 hard errs)
16-Oct-2020 08:35:38                                                                                                                                                      
16-Oct-2020 08:35:38       [OK] reactor.pool.SimpleDequePoolStressTest.MaxPendingAcquireWhileDestroying
16-Oct-2020 08:35:39 (ETA:   00:00:12) (Rate: 7.83E+05 samples/sec) (Tests: 2 of 2) (Forks:  5 of 8) (Iterations: 25 of 48; 25 passed, 0 failed, 0 soft errs, 0 hard errs)
16-Oct-2020 08:35:39                                                                                                                                                      
16-Oct-2020 08:35:39       [OK] reactor.pool.SimpleDequePoolStressTest.MaxPendingAcquireWhileDestroying
16-Oct-2020 08:35:40 (ETA:   00:00:12) (Rate: 7.68E+05 samples/sec) (Tests: 2 of 2) (Forks:  5 of 8) (Iterations: 26 of 48; 26 passed, 0 failed, 0 soft errs, 0 hard errs)
16-Oct-2020 08:35:40                                                                                                                                                      
16-Oct-2020 08:35:40       [OK] reactor.pool.SimpleDequePoolStressTest.MaxPendingAcquireWhileDestroying
16-Oct-2020 08:35:42 (ETA:   00:00:11) (Rate: 7.34E+05 samples/sec) (Tests: 2 of 2) (Forks:  5 of 8) (Iterations: 27 of 48; 27 passed, 0 failed, 0 soft errs, 0 hard errs)
16-Oct-2020 08:35:42                                                                                                                                                      
16-Oct-2020 08:35:42       [OK] reactor.pool.SimpleDequePoolStressTest.MaxPendingAcquireWhileDestroying
16-Oct-2020 08:35:43 (ETA:   00:00:11) (Rate: 7.33E+05 samples/sec) (Tests: 2 of 2) (Forks:  5 of 8) (Iterations: 28 of 48; 28 passed, 0 failed, 0 soft errs, 0 hard errs)
16-Oct-2020 08:35:43                                                                                                                                                      
16-Oct-2020 08:35:43       [OK] reactor.pool.SimpleDequePoolStressTest.MaxPendingAcquireWhileDestroying
16-Oct-2020 08:35:44 (ETA:   00:00:11) (Rate: 7.28E+05 samples/sec) (Tests: 2 of 2) (Forks:  5 of 8) (Iterations: 29 of 48; 29 passed, 0 failed, 0 soft errs, 0 hard errs)
16-Oct-2020 08:35:44                                                                                                                                                      
16-Oct-2020 08:35:44       [OK] reactor.pool.SimpleDequePoolStressTest.MaxPendingAcquireWhileDestroying
16-Oct-2020 08:35:45 (ETA:   00:00:10) (Rate: 7.26E+05 samples/sec) (Tests: 2 of 2) (Forks:  5 of 8) (Iterations: 30 of 48; 30 passed, 0 failed, 0 soft errs, 0 hard errs)
16-Oct-2020 08:35:45                                                                                                                                                      
16-Oct-2020 08:35:45       [OK] reactor.pool.SimpleDequePoolStressTest.BackgroundEvictionVsAcquire
16-Oct-2020 08:35:46 (ETA:   00:00:10) (Rate: 7.05E+05 samples/sec) (Tests: 2 of 2) (Forks:  6 of 8) (Iterations: 31 of 48; 31 passed, 0 failed, 0 soft errs, 0 hard errs)
16-Oct-2020 08:35:46                                                                                                                                                      
16-Oct-2020 08:35:46       [OK] reactor.pool.SimpleDequePoolStressTest.BackgroundEvictionVsAcquire
16-Oct-2020 08:35:47 (ETA:   00:00:09) (Rate: 6.93E+05 samples/sec) (Tests: 2 of 2) (Forks:  6 of 8) (Iterations: 32 of 48; 32 passed, 0 failed, 0 soft errs, 0 hard errs)
16-Oct-2020 08:35:47                                                                                                                                                      
16-Oct-2020 08:35:47       [OK] reactor.pool.SimpleDequePoolStressTest.BackgroundEvictionVsAcquire
16-Oct-2020 08:35:48 (ETA:   00:00:09) (Rate: 6.65E+05 samples/sec) (Tests: 2 of 2) (Forks:  6 of 8) (Iterations: 33 of 48; 33 passed, 0 failed, 0 soft errs, 0 hard errs)
16-Oct-2020 08:35:48                                                                                                                                                      
16-Oct-2020 08:35:48       [OK] reactor.pool.SimpleDequePoolStressTest.BackgroundEvictionVsAcquire
16-Oct-2020 08:35:49 (ETA:   00:00:08) (Rate: 6.57E+05 samples/sec) (Tests: 2 of 2) (Forks:  6 of 8) (Iterations: 34 of 48; 34 passed, 0 failed, 0 soft errs, 0 hard errs)
16-Oct-2020 08:35:49                                                                                                                                                      
16-Oct-2020 08:35:49       [OK] reactor.pool.SimpleDequePoolStressTest.BackgroundEvictionVsAcquire
16-Oct-2020 08:35:50 (ETA:   00:00:08) (Rate: 6.51E+05 samples/sec) (Tests: 2 of 2) (Forks:  6 of 8) (Iterations: 35 of 48; 35 passed, 0 failed, 0 soft errs, 0 hard errs)
16-Oct-2020 08:35:50                                                                                                                                                      
16-Oct-2020 08:35:50       [OK] reactor.pool.SimpleDequePoolStressTest.BackgroundEvictionVsAcquire
16-Oct-2020 08:35:54 (ETA:   00:00:07) (Rate: 6.41E+05 samples/sec) (Tests: 2 of 2) (Forks:  6 of 8) (Iterations: 36 of 48; 36 passed, 0 failed, 0 soft errs, 0 hard errs)
16-Oct-2020 08:35:54                                                                                                                                                      
16-Oct-2020 08:35:54       [OK] reactor.pool.SimpleDequePoolStressTest.BackgroundEvictionVsAcquire
16-Oct-2020 08:35:55 (ETA:   00:00:07) (Rate: 5.59E+05 samples/sec) (Tests: 2 of 2) (Forks:  7 of 8) (Iterations: 37 of 48; 37 passed, 0 failed, 0 soft errs, 0 hard errs)
16-Oct-2020 08:35:55                                                                                                                                                      
16-Oct-2020 08:35:55       [OK] reactor.pool.SimpleDequePoolStressTest.BackgroundEvictionVsAcquire
16-Oct-2020 08:35:56 (ETA:   00:00:07) (Rate: 5.41E+05 samples/sec) (Tests: 2 of 2) (Forks:  7 of 8) (Iterations: 38 of 48; 38 passed, 0 failed, 0 soft errs, 0 hard errs)
16-Oct-2020 08:35:56                                                                                                                                                      
16-Oct-2020 08:35:56       [OK] reactor.pool.SimpleDequePoolStressTest.BackgroundEvictionVsAcquire
16-Oct-2020 08:35:57 (ETA:   00:00:06) (Rate: 5.24E+05 samples/sec) (Tests: 2 of 2) (Forks:  7 of 8) (Iterations: 39 of 48; 39 passed, 0 failed, 0 soft errs, 0 hard errs)
16-Oct-2020 08:35:57                                                                                                                                                      
16-Oct-2020 08:35:57       [OK] reactor.pool.SimpleDequePoolStressTest.BackgroundEvictionVsAcquire
16-Oct-2020 08:35:58 (ETA:   00:00:05) (Rate: 5.08E+05 samples/sec) (Tests: 2 of 2) (Forks:  7 of 8) (Iterations: 40 of 48; 40 passed, 0 failed, 0 soft errs, 0 hard errs)
16-Oct-2020 08:35:58                                                                                                                                                      
16-Oct-2020 08:35:58       [OK] reactor.pool.SimpleDequePoolStressTest.BackgroundEvictionVsAcquire
16-Oct-2020 08:35:59 (ETA:   00:00:04) (Rate: 4.93E+05 samples/sec) (Tests: 2 of 2) (Forks:  7 of 8) (Iterations: 41 of 48; 41 passed, 0 failed, 0 soft errs, 0 hard errs)
16-Oct-2020 08:35:59                                                                                                                                                      
16-Oct-2020 08:35:59       [OK] reactor.pool.SimpleDequePoolStressTest.BackgroundEvictionVsAcquire
16-Oct-2020 08:36:19 (ETA:   00:00:04) (Rate: 4.78E+05 samples/sec) (Tests: 2 of 2) (Forks:  7 of 8) (Iterations: 42 of 48; 42 passed, 0 failed, 0 soft errs, 0 hard errs)
16-Oct-2020 08:36:19                                                                                                                                                      
16-Oct-2020 08:36:19       [OK] reactor.pool.SimpleDequePoolStressTest.MaxPendingAcquireWhileDestroying
16-Oct-2020 08:36:20 (ETA:   00:00:05) (Rate: 3.03E+05 samples/sec) (Tests: 2 of 2) (Forks:  8 of 8) (Iterations: 43 of 48; 43 passed, 0 failed, 0 soft errs, 0 hard errs)
16-Oct-2020 08:36:20                                                                                                                                                      
16-Oct-2020 08:36:20       [OK] reactor.pool.SimpleDequePoolStressTest.MaxPendingAcquireWhileDestroying
16-Oct-2020 08:36:21 (ETA:   00:00:03) (Rate: 2.98E+05 samples/sec) (Tests: 2 of 2) (Forks:  8 of 8) (Iterations: 44 of 48; 44 passed, 0 failed, 0 soft errs, 0 hard errs)
16-Oct-2020 08:36:21                                                                                                                                                      
16-Oct-2020 08:36:21       [OK] reactor.pool.SimpleDequePoolStressTest.MaxPendingAcquireWhileDestroying
16-Oct-2020 08:36:22 (ETA:   00:00:02) (Rate: 2.93E+05 samples/sec) (Tests: 2 of 2) (Forks:  8 of 8) (Iterations: 45 of 48; 45 passed, 0 failed, 0 soft errs, 0 hard errs)
16-Oct-2020 08:36:22                                                                                                                                                      
16-Oct-2020 08:36:22       [OK] reactor.pool.SimpleDequePoolStressTest.MaxPendingAcquireWhileDestroying
16-Oct-2020 08:36:23 (ETA:   00:00:01) (Rate: 2.88E+05 samples/sec) (Tests: 2 of 2) (Forks:  8 of 8) (Iterations: 46 of 48; 46 passed, 0 failed, 0 soft errs, 0 hard errs)
16-Oct-2020 08:36:23                                                                                                                                                      
16-Oct-2020 08:36:23       [OK] reactor.pool.SimpleDequePoolStressTest.MaxPendingAcquireWhileDestroying
16-Oct-2020 08:36:24 (ETA:        now) (Rate: 2.84E+05 samples/sec) (Tests: 2 of 2) (Forks:  8 of 8) (Iterations: 47 of 48; 47 passed, 0 failed, 0 soft errs, 0 hard errs)
16-Oct-2020 08:36:24                                                                                                                                                      
16-Oct-2020 08:36:24       [OK] reactor.pool.SimpleDequePoolStressTest.MaxPendingAcquireWhileDestroying
16-Oct-2020 08:36:25 (ETA:        now) (Rate: 2.79E+05 samples/sec) (Tests: 2 of 2) (Forks:  8 of 8) (Iterations: 48 of 48; 48 passed, 0 failed, 0 soft errs, 0 hard errs)
16-Oct-2020 08:36:25
16-Oct-2020 08:36:25 RUN COMPLETE.
16-Oct-2020 08:36:25
16-Oct-2020 08:36:25 RUN RESULTS:
16-Oct-2020 08:36:25 ------------------------------------------------------------------------------------------------------------------------
16-Oct-2020 08:36:25
16-Oct-2020 08:36:25 *** INTERESTING tests
16-Oct-2020 08:36:25   Some interesting behaviors observed. This is for the plain curiosity.
16-Oct-2020 08:36:25
16-Oct-2020 08:36:25   0 matching test results.
16-Oct-2020 08:36:25
16-Oct-2020 08:36:25 *** FAILED tests
16-Oct-2020 08:36:25   Strong asserts were violated. Correct implementations should have no assert failures here.
16-Oct-2020 08:36:25
16-Oct-2020 08:36:25   0 matching test results.
16-Oct-2020 08:36:25
16-Oct-2020 08:36:25 *** ERROR tests
16-Oct-2020 08:36:25   Tests break for some reason, other than failing the assert. Correct implementations should have none.
16-Oct-2020 08:36:25
16-Oct-2020 08:36:25   0 matching test results.
16-Oct-2020 08:36:25
16-Oct-2020 08:36:25 *** All remaining tests
16-Oct-2020 08:36:25   Tests that do not fall into any of the previous categories.
16-Oct-2020 08:36:25
16-Oct-2020 08:36:25   8 matching test results.  Use -v to print them.
16-Oct-2020 08:36:25
16-Oct-2020 08:36:25 ------------------------------------------------------------------------------------------------------------------------
16-Oct-2020 08:36:25
16-Oct-2020 08:36:25 HTML report was generated. Look at /opt/bamboo-home/xml-data/build-dir/REACTOR-RPOOL-JOB1/build/reports/jcstress/index.html for the complete run results.
16-Oct-2020 08:36:25
16-Oct-2020 08:36:25 Will throw any pending exceptions at this point.
16-Oct-2020 08:36:25 Done.
16-Oct-2020 08:36:25
16-Oct-2020 08:36:25 > Task :licenseJcstress UP-TO-DATE
16-Oct-2020 08:36:25 > Task :licenseMain UP-TO-DATE
16-Oct-2020 08:36:25 > Task :licenseTest UP-TO-DATE
16-Oct-2020 08:36:25 > Task :license UP-TO-DATE
16-Oct-2020 08:36:25 > Task :check
16-Oct-2020 08:36:25 > Task :distTar NO-SOURCE
16-Oct-2020 08:36:25 > Task :distZip NO-SOURCE
16-Oct-2020 08:36:25 > Task :jcstressScripts
16-Oct-2020 08:36:25 > Task :jcstressDistTar
16-Oct-2020 08:36:25 > Task :jcstressDistZip
16-Oct-2020 08:36:25 > Task :assemble
16-Oct-2020 08:36:26 > Task :generateMetadataFileForMavenJavaPublication
16-Oct-2020 08:36:26 > Task :generatePomFileForMavenJavaPublication
16-Oct-2020 08:36:27 > Task :javadoc
16-Oct-2020 08:36:27 > Task :javadocJar
16-Oct-2020 08:36:27 > Task :sourcesJar
16-Oct-2020 08:36:27 > Task :artifactoryPublish
16-Oct-2020 08:36:28 > Task :extractModuleInfo
16-Oct-2020 08:36:28 [pool-6-thread-1] Deploying artifact: https://repo.spring.io/libs-snapshot-local/io/projectreactor/addons/reactor-pool/0.2.0-SNAPSHOT/reactor-pool-0.2.0-SNAPSHOT-javadoc.jar
16-Oct-2020 08:36:28 [pool-6-thread-1] Deploying artifact: https://repo.spring.io/libs-snapshot-local/io/projectreactor/addons/reactor-pool/0.2.0-SNAPSHOT/reactor-pool-0.2.0-SNAPSHOT-sources.jar
16-Oct-2020 08:36:29 [pool-6-thread-1] Deploying artifact: https://repo.spring.io/libs-snapshot-local/io/projectreactor/addons/reactor-pool/0.2.0-SNAPSHOT/reactor-pool-0.2.0-SNAPSHOT.jar
16-Oct-2020 08:36:29 [pool-6-thread-1] Deploying artifact: https://repo.spring.io/libs-snapshot-local/io/projectreactor/addons/reactor-pool/0.2.0-SNAPSHOT/reactor-pool-0.2.0-SNAPSHOT.module
16-Oct-2020 08:36:30 [pool-6-thread-1] Deploying artifact: https://repo.spring.io/libs-snapshot-local/io/projectreactor/addons/reactor-pool/0.2.0-SNAPSHOT/reactor-pool-0.2.0-SNAPSHOT.pom
16-Oct-2020 08:36:30
16-Oct-2020 08:36:30 > Task :artifactoryDeploy
16-Oct-2020 08:36:30 Deploying build descriptor to: https://repo.spring.io/api/build
16-Oct-2020 08:36:31 Build successfully deployed. Browse it in Artifactory under https://repo.spring.io/webapp/builds/Project%20Reactor%20-%20Reactor%20Pool%20-%20Reactor%20Pool/126
16-Oct-2020 08:36:31
16-Oct-2020 08:36:31 Deprecated Gradle features were used in this build, making it incompatible with Gradle 7.0.
16-Oct-2020 08:36:31 Use '--warning-mode all' to show the individual deprecation warnings.
16-Oct-2020 08:36:31 See https://docs.gradle.org/6.5.1/userguide/command_line_interface.html#sec:command_line_warnings
16-Oct-2020 08:36:31
16-Oct-2020 08:36:31 BUILD SUCCESSFUL in 5m 43s
16-Oct-2020 08:36:31 26 actionable tasks: 23 executed, 3 up-to-date
16-Oct-2020 08:36:31 Parsing test results under /opt/bamboo-home/xml-data/build-dir/REACTOR-RPOOL-JOB1...
16-Oct-2020 08:36:31 Finished task 'Build Check Assemble' with result: Success
16-Oct-2020 08:36:31 Running post build plugin 'Docker Container Cleanup'
16-Oct-2020 08:36:31 Running post build plugin 'NCover Results Collector'
16-Oct-2020 08:36:31 Running post build plugin 'Artifactory Release Management Staging'
16-Oct-2020 08:36:31 Running post build plugin 'Artifactory Build Info Copier'
16-Oct-2020 08:36:31 Running post build plugin 'Artifactory Gradle Properties Info Copier'
16-Oct-2020 08:36:31 Running post build plugin 'Clover Results Collector'
16-Oct-2020 08:36:31 Running post build plugin 'npm Cache Cleanup'
16-Oct-2020 08:36:31 Running post build plugin 'Artifact Copier'
16-Oct-2020 08:36:31 Publishing an artifact: test-report
16-Oct-2020 08:36:31 Finished publishing of artifact Non required job artifact: [test-report], pattern: [**/build/reports/tests/**] in 25.02 ms
16-Oct-2020 08:36:31 Successfully removed working directory at '/opt/bamboo-home/xml-data/build-dir/REACTOR-RPOOL-JOB1'
16-Oct-2020 08:36:31 Finalising the build...
16-Oct-2020 08:36:31 Stopping timer.
16-Oct-2020 08:36:31 Build REACTOR-RPOOL-JOB1-126 completed.
16-Oct-2020 08:36:31 Running on server: post build plugin 'NCover Results Collector'
16-Oct-2020 08:36:31 Running on server: post build plugin 'Build Hanging Detection Configuration'
16-Oct-2020 08:36:31 Running on server: post build plugin 'Bamboo project link creator'
16-Oct-2020 08:36:31 Running on server: post build plugin 'Clover Delta Calculator'
16-Oct-2020 08:36:31 Running on server: post build plugin 'Maven Dependencies Postprocessor'
16-Oct-2020 08:36:31 All post build plugins have finished
16-Oct-2020 08:36:31 Generating build results summary...
16-Oct-2020 08:36:31 Saving build results to disk...
16-Oct-2020 08:36:31 Logging substituted variables...
16-Oct-2020 08:36:31 Indexing build results...
16-Oct-2020 08:36:31 Finished building REACTOR-RPOOL-JOB1-126.