Build: #610 failed Manual run by Stephane Maldini

Build result summary

Details

Completed
Duration
8 minutes
Labels
None
Revision
c836d26a624de74fb33feab4c32705a039d14186 c836d26a624de74fb33feab4c32705a039d14186
Total tests
1055
Fixed in
#612 (Manual run by Stephane Maldini)
No failed test found. A possible compilation error occurred.

Tests

Responsible

No one has taken responsibility for this failure

Error summary for Default Job

The job generated some errors, drill down into the full build log for more details.

/opt/bamboo-home/xml-data/build-dir/REACTOR-RSC-JOB1/src/main/java/rsc/publisher/PublisherSample.java:17: warning: empty <p> tag
* <p>
   ^
/opt/bamboo-home/xml-data/build-dir/REACTOR-RSC-JOB1/src/main/java/rsc/publisher/PublisherSample.java:21: warning: empty <p> tag
* <p>
   ^
/opt/bamboo-home/xml-data/build-dir/REACTOR-RSC-JOB1/src/main/java/rsc/publisher/PublisherSingle.java:45: warning: no description for @param
     * @param <T>
       ^
/opt/bamboo-home/xml-data/build-dir/REACTOR-RSC-JOB1/src/main/java/rsc/publisher/PublisherSubscribeOnValue.java:17: warning: no description for @param
* @param <T>
   ^
/opt/bamboo-home/xml-data/build-dir/REACTOR-RSC-JOB1/src/main/java/rsc/publisher/PublisherUsing.java:22: warning: empty <p> tag
* <p>
   ^
/opt/bamboo-home/xml-data/build-dir/REACTOR-RSC-JOB1/src/main/java/rsc/publisher/PublisherWithLatestFrom.java:18: warning: empty <p> tag
* <p>
   ^
/opt/bamboo-home/xml-data/build-dir/REACTOR-RSC-JOB1/src/main/java/rsc/publisher/SynchronousSink.java:51: warning: no description for @throws
     * @throws RuntimeException
       ^
/opt/bamboo-home/xml-data/build-dir/REACTOR-RSC-JOB1/src/main/java/rsc/parallel/OrderedItem.java:17: warning: no description for @param
     * @param newValue
       ^
/opt/bamboo-home/xml-data/build-dir/REACTOR-RSC-JOB1/src/main/java/rsc/util/BackpressureHelper.java:30: error: bad use of '>'
     * @param n the value to add, n > 0, not validated
                                    ^
/opt/bamboo-home/xml-data/build-dir/REACTOR-RSC-JOB1/src/main/java/rsc/util/DrainHelper.java:20: warning: no description for @param
     * @param n
       ^
/opt/bamboo-home/xml-data/build-dir/REACTOR-RSC-JOB1/src/main/java/rsc/util/DrainHelper.java:21: warning: no description for @param
     * @param actual
       ^
/opt/bamboo-home/xml-data/build-dir/REACTOR-RSC-JOB1/src/main/java/rsc/util/DrainHelper.java:22: warning: no description for @param
     * @param queue
       ^
/opt/bamboo-home/xml-data/build-dir/REACTOR-RSC-JOB1/src/main/java/rsc/util/DrainHelper.java:23: warning: no description for @param
     * @param state
       ^
/opt/bamboo-home/xml-data/build-dir/REACTOR-RSC-JOB1/src/main/java/rsc/util/DrainHelper.java:24: warning: no description for @param
     * @param isCancelled
       ^
/opt/bamboo-home/xml-data/build-dir/REACTOR-RSC-JOB1/src/main/java/rsc/util/DrainHelper.java:141: warning: no description for @param
     * @param actual
       ^
/opt/bamboo-home/xml-data/build-dir/REACTOR-RSC-JOB1/src/main/java/rsc/util/DrainHelper.java:142: warning: no description for @param
     * @param queue
       ^
/opt/bamboo-home/xml-data/build-dir/REACTOR-RSC-JOB1/src/main/java/rsc/util/DrainHelper.java:143: warning: no description for @param
     * @param state
       ^
/opt/bamboo-home/xml-data/build-dir/REACTOR-RSC-JOB1/src/main/java/rsc/util/DrainHelper.java:144: warning: no description for @param
     * @param isCancelled
       ^
/opt/bamboo-home/xml-data/build-dir/REACTOR-RSC-JOB1/src/main/java/rsc/util/DrainHelper.java:186: warning: no description for @param
     * @param n
       ^
/opt/bamboo-home/xml-data/build-dir/REACTOR-RSC-JOB1/src/main/java/rsc/util/DrainHelper.java:187: warning: no description for @param
     * @param actual
       ^
/opt/bamboo-home/xml-data/build-dir/REACTOR-RSC-JOB1/src/main/java/rsc/util/DrainHelper.java:188: warning: no description for @param
     * @param queue
       ^
/opt/bamboo-home/xml-data/build-dir/REACTOR-RSC-JOB1/src/main/java/rsc/util/DrainHelper.java:189: warning: no description for @param
     * @param field
       ^
/opt/bamboo-home/xml-data/build-dir/REACTOR-RSC-JOB1/src/main/java/rsc/util/DrainHelper.java:190: warning: no description for @param
     * @param instance
       ^
/opt/bamboo-home/xml-data/build-dir/REACTOR-RSC-JOB1/src/main/java/rsc/util/DrainHelper.java:191: warning: no description for @param
     * @param isCancelled
       ^
/opt/bamboo-home/xml-data/build-dir/REACTOR-RSC-JOB1/src/main/java/rsc/util/DrainHelper.java:311: warning: no description for @param
     * @param actual
       ^
/opt/bamboo-home/xml-data/build-dir/REACTOR-RSC-JOB1/src/main/java/rsc/util/DrainHelper.java:312: warning: no description for @param
     * @param queue
       ^
/opt/bamboo-home/xml-data/build-dir/REACTOR-RSC-JOB1/src/main/java/rsc/util/DrainHelper.java:313: warning: no description for @param
     * @param field
       ^
/opt/bamboo-home/xml-data/build-dir/REACTOR-RSC-JOB1/src/main/java/rsc/util/DrainHelper.java:314: warning: no description for @param
     * @param instance
       ^
/opt/bamboo-home/xml-data/build-dir/REACTOR-RSC-JOB1/src/main/java/rsc/util/DrainHelper.java:315: warning: no description for @param
     * @param isCancelled
       ^
/opt/bamboo-home/xml-data/build-dir/REACTOR-RSC-JOB1/src/main/java/rsc/util/ExceptionHelper.java:60: warning: no description for @param
     * @param t
       ^

FAILURE: Build failed with an exception.

* What went wrong:
Execution failed for task ':artifactoryDeploy'.
> java.io.IOException: Failed to deploy file. Status code: 401 Response message: Artifactory returned the following errors:
  Unauthorized Status code: 401

* Try:
Run with --stacktrace option to get the stack trace. Run with --info or --debug option to get more log output.