Build: #610 failed Manual run by Stephane Maldini

Logs

The following logs have been generated by the jobs in this plan.
  • Expand all
  • Collapse all
Job Logs
Collapse Default Job Default Stage Download or View
12-Mar-2019 23:03:52 3 errors
12-Mar-2019 23:03:52 55 warnings
12-Mar-2019 23:03:52 :javadocJar
12-Mar-2019 23:03:52 :sourcesJar
12-Mar-2019 23:03:52 :assemble
12-Mar-2019 23:03:53 :install
12-Mar-2019 23:03:53 :uploadArchives
12-Mar-2019 23:03:53 :artifactoryPublish
12-Mar-2019 23:03:53 :artifactoryDeploy
12-Mar-2019 23:03:53 Deploying artifact: https://repo.spring.io/libs-snapshot-local/io/projectreactor/reactive-streams-commons/0.6.0.BUILD-SNAPSHOT/reactive-streams-commons-0.6.0.BUILD-SNAPSHOT-javadoc.jar
12-Mar-2019 23:06:10 :artifactoryDeploy FAILED
12-Mar-2019 23:06:10
12-Mar-2019 23:06:10 FAILURE: Build failed with an exception.
12-Mar-2019 23:06:10
12-Mar-2019 23:06:10 * What went wrong:
12-Mar-2019 23:06:10 Execution failed for task ':artifactoryDeploy'.
12-Mar-2019 23:06:10 > java.io.IOException: Failed to deploy file. Status code: 401 Response message: Artifactory returned the following errors:
12-Mar-2019 23:06:10   Unauthorized Status code: 401
12-Mar-2019 23:06:10
12-Mar-2019 23:06:10 * Try:
12-Mar-2019 23:06:10
12-Mar-2019 23:06:10 BUILD FAILED
12-Mar-2019 23:06:10
12-Mar-2019 23:06:10 Run with --stacktrace option to get the stack trace. Run with --info or --debug option to get more log output.
12-Mar-2019 23:06:10 Total time: 8 mins 5.182 secs