Build: #611 failed Manual run by Stephane Maldini

Build result summary

Details

Completed
Duration
5 minutes
Labels
None
Revision
c836d26a624de74fb33feab4c32705a039d14186 c836d26a624de74fb33feab4c32705a039d14186
Total tests
1055
Failing since
#610 (Manual run by Stephane Maldini)
Fixed in
#612 (Manual run by Stephane Maldini)

Tests

Responsible

This build has been failing since #610
No one has taken responsibility

Tests

New test failures 1
Status Test View job Duration
Collapse Failed PublisherObserveOnTest crossRangeMaxHiddenLoop History
Default Job 45 secs
java.lang.AssertionError: java.lang.AssertionError: (active) TestSubscriber timed out. Received: 1999938, last event: 9249 ms ago; values = 1999938
java.lang.AssertionError: (active) TestSubscriber timed out. Received: 1999938, last event: 9249 ms ago; values = 1999938
	at rsc.test.TestSubscriber.assertionError(TestSubscriber.java:209)
	at rsc.test.TestSubscriber.assertTerminated(TestSubscriber.java:712)
	at rsc.publisher.PublisherObserveOnTest.crossRangeMaxHidden(PublisherObserveOnTest.java:714)
	at rsc.publisher.PublisherObserveOnTest.crossRangeMaxHiddenLoop(PublisherObserveOnTest.java:699)
	at sun.reflect.NativeMethodAccessorImpl.invoke0(Native Method)
	at sun.reflect.NativeMethodAccessorImpl.invoke(NativeMethodAccessorImpl.java:62)
(41 more lines...)