Build: #611 failed Manual run by Stephane Maldini

Logs

The following logs have been generated by the jobs in this plan.
  • Expand all
  • Collapse all
Job Logs
Collapse Default Job Default Stage Download or View
12-Mar-2019 23:45:57 rsc.util.ConstructorTestBuilderTest > compileWithParamNames STARTED
12-Mar-2019 23:45:57
12-Mar-2019 23:45:57 rsc.util.ConstructorTestBuilderTest > noRefNullCheck STARTED
12-Mar-2019 23:45:57
12-Mar-2019 23:45:57 rsc.util.ConstructorTestBuilderTest > noRangeCheck STARTED
12-Mar-2019 23:45:57
12-Mar-2019 23:45:57 rsc.util.SpscLinkedArrayQueueTest > offerTakeOneByOne STARTED
12-Mar-2019 23:45:57
12-Mar-2019 23:45:57 rsc.util.SpscLinkedArrayQueueTest > grow STARTED
12-Mar-2019 23:45:57
12-Mar-2019 23:45:57 1055 tests completed, 1 failed, 1 skipped
12-Mar-2019 23:45:57 :test FAILED
12-Mar-2019 23:45:57
12-Mar-2019 23:45:57 FAILURE: Build failed with an exception.
12-Mar-2019 23:45:57
12-Mar-2019 23:45:57 * What went wrong:
12-Mar-2019 23:45:57 Execution failed for task ':test'.
12-Mar-2019 23:45:57 > There were failing tests. See the report at: file:///opt/bamboo-home/xml-data/build-dir/REACTOR-RSC-JOB1/build/reports/tests/index.html
12-Mar-2019 23:45:57
12-Mar-2019 23:45:57 * Try:
12-Mar-2019 23:45:57 Run with --stacktrace option to get the stack trace. Run with --info or --debug option to get more log output.
12-Mar-2019 23:45:57
12-Mar-2019 23:45:57 BUILD FAILED
12-Mar-2019 23:45:57
12-Mar-2019 23:45:57 Total time: 5 mins 38.261 secs