Build: #611 failed Manual run by Stephane Maldini

Test results

  • 1,055 tests in total
  • 1 test failed
  • 1 failure is new
  • 1 test was quarantined / skipped
  • 5 minutes taken in total.
New test failures 1
Status Test View job Duration
Collapse Failed PublisherObserveOnTest crossRangeMaxHiddenLoop History
Default Job 45 secs
java.lang.AssertionError: java.lang.AssertionError: (active) TestSubscriber timed out. Received: 1999938, last event: 9249 ms ago; values = 1999938
java.lang.AssertionError: (active) TestSubscriber timed out. Received: 1999938, last event: 9249 ms ago; values = 1999938
	at rsc.test.TestSubscriber.assertionError(TestSubscriber.java:209)
	at rsc.test.TestSubscriber.assertTerminated(TestSubscriber.java:712)
	at rsc.publisher.PublisherObserveOnTest.crossRangeMaxHidden(PublisherObserveOnTest.java:714)
	at rsc.publisher.PublisherObserveOnTest.crossRangeMaxHiddenLoop(PublisherObserveOnTest.java:699)
	at sun.reflect.NativeMethodAccessorImpl.invoke0(Native Method)
	at sun.reflect.NativeMethodAccessorImpl.invoke(NativeMethodAccessorImpl.java:62)
(41 more lines...)
Skipped tests 1
Status Test Failing since View job
Skipped PublisherFlatMapTest slowDrainLoop History
Default Job