Build: #610 failed

Job: Default Job failed

Stages & jobs

  1. Default Stage

Build log

The build generated 2,391 lines of output.The output is too long and has been truncated to the last 1,000 lines. Download or view full build log

12-Mar-2019 23:02:12
12-Mar-2019 23:02:12 rsc.publisher.PublisherFilterTest > sourceNull STARTED
12-Mar-2019 23:02:12
12-Mar-2019 23:02:12 rsc.publisher.PublisherFilterTest > normal STARTED
12-Mar-2019 23:02:12
12-Mar-2019 23:02:12 rsc.publisher.PublisherFilterTest > predicateNull STARTED
12-Mar-2019 23:02:12
12-Mar-2019 23:02:12 rsc.publisher.PublisherFilterTest > asyncFusion STARTED
12-Mar-2019 23:02:12
12-Mar-2019 23:02:12 rsc.publisher.PublisherFilterTest > asyncFusionBackpressured STARTED
12-Mar-2019 23:02:12
12-Mar-2019 23:02:12 rsc.publisher.PublisherFilterTest > predicateThrows STARTED
12-Mar-2019 23:02:12
12-Mar-2019 23:02:12 rsc.publisher.PublisherFilterTest > normalBackpressuredIterable STARTED
12-Mar-2019 23:02:12
12-Mar-2019 23:02:12 rsc.publisher.PublisherFilterTest > syncFusion STARTED
12-Mar-2019 23:02:12
12-Mar-2019 23:02:12 rsc.publisher.PublisherFilterTest > asyncFusionBackpressured2 STARTED
12-Mar-2019 23:02:12
12-Mar-2019 23:02:12 rsc.publisher.PublisherUsingTest > resourceCleanupNull STARTED
12-Mar-2019 23:02:12
12-Mar-2019 23:02:12 rsc.publisher.PublisherUsingTest > resourceSupplierNull STARTED
12-Mar-2019 23:02:12
12-Mar-2019 23:02:12 rsc.publisher.PublisherUsingTest > resourceThrowsEager STARTED
12-Mar-2019 23:02:12
12-Mar-2019 23:02:12 rsc.publisher.PublisherUsingTest > checkErrorEager STARTED
12-Mar-2019 23:02:12
12-Mar-2019 23:02:12 rsc.publisher.PublisherUsingTest > factoryReturnsNull STARTED
12-Mar-2019 23:02:12
12-Mar-2019 23:02:12 rsc.publisher.PublisherUsingTest > subscriberCancels STARTED
12-Mar-2019 23:02:12
12-Mar-2019 23:02:12 rsc.publisher.PublisherUsingTest > normal STARTED
12-Mar-2019 23:02:12
12-Mar-2019 23:02:12 rsc.publisher.PublisherUsingTest > checkEager STARTED
12-Mar-2019 23:02:12
12-Mar-2019 23:02:12 rsc.publisher.PublisherUsingTest > checkNonEager STARTED
12-Mar-2019 23:02:12
12-Mar-2019 23:02:12 rsc.publisher.PublisherUsingTest > normalEager STARTED
12-Mar-2019 23:02:12
12-Mar-2019 23:02:12 rsc.publisher.PublisherUsingTest > factoryThrowsEager STARTED
12-Mar-2019 23:02:12
12-Mar-2019 23:02:12 rsc.publisher.PublisherUsingTest > checkErrorNonEager STARTED
12-Mar-2019 23:02:12
12-Mar-2019 23:02:12 rsc.publisher.PublisherUsingTest > sourceFactoryNull STARTED
12-Mar-2019 23:02:12
12-Mar-2019 23:02:12 rsc.publisher.PublisherEmptyTest > normal STARTED
12-Mar-2019 23:02:12
12-Mar-2019 23:02:12 rsc.publisher.PublisherEmptyTest > singleInstance STARTED
12-Mar-2019 23:02:12
12-Mar-2019 23:02:12 rsc.publisher.PublisherRepeatTest > timesInvalid STARTED
12-Mar-2019 23:02:12
12-Mar-2019 23:02:12 rsc.publisher.PublisherRepeatTest > repeatInfinite STARTED
12-Mar-2019 23:02:12
12-Mar-2019 23:02:12 rsc.publisher.PublisherRepeatTest > zeroRepeat STARTED
12-Mar-2019 23:02:12
12-Mar-2019 23:02:12 rsc.publisher.PublisherRepeatTest > sourceNull STARTED
12-Mar-2019 23:02:12
12-Mar-2019 23:02:12 rsc.publisher.PublisherRepeatTest > twoRepeat STARTED
12-Mar-2019 23:02:12
12-Mar-2019 23:02:12 rsc.publisher.PublisherRepeatTest > oneRepeatBackpressured STARTED
12-Mar-2019 23:02:12
12-Mar-2019 23:02:12 rsc.publisher.PublisherRepeatTest > twoRepeatBackpressured STARTED
12-Mar-2019 23:02:12
12-Mar-2019 23:02:12 rsc.publisher.PublisherRepeatTest > oneRepeat STARTED
12-Mar-2019 23:02:12
12-Mar-2019 23:02:12 rsc.publisher.PublisherTakeLastTest > takeAll STARTED
12-Mar-2019 23:02:12
12-Mar-2019 23:02:12 rsc.publisher.PublisherTakeLastTest > takeOne STARTED
12-Mar-2019 23:02:12
12-Mar-2019 23:02:12 rsc.publisher.PublisherTakeLastTest > sourceNull STARTED
12-Mar-2019 23:02:12
12-Mar-2019 23:02:12 rsc.publisher.PublisherTakeLastTest > takeNone STARTED
12-Mar-2019 23:02:12
12-Mar-2019 23:02:12 rsc.publisher.PublisherTakeLastTest > takeSome STARTED
12-Mar-2019 23:02:12
12-Mar-2019 23:02:12 rsc.publisher.PublisherTakeLastTest > takeNoneBackpressured STARTED
12-Mar-2019 23:02:12
12-Mar-2019 23:02:12 rsc.publisher.PublisherTakeLastTest > takeOneBackpressured STARTED
12-Mar-2019 23:02:12
12-Mar-2019 23:02:12 rsc.publisher.PublisherTakeLastTest > takeSomeBackpressured STARTED
12-Mar-2019 23:02:12
12-Mar-2019 23:02:12 rsc.publisher.PublisherTakeLastTest > takeAllBackpressured STARTED
12-Mar-2019 23:02:12
12-Mar-2019 23:02:12 rsc.publisher.PublisherTakeLastTest > negativeNumber STARTED
12-Mar-2019 23:02:12
12-Mar-2019 23:02:12 rsc.publisher.PublisherSkipWhileTest > sourceNull STARTED
12-Mar-2019 23:02:12
12-Mar-2019 23:02:12 rsc.publisher.PublisherSkipWhileTest > predicateNull STARTED
12-Mar-2019 23:02:12
12-Mar-2019 23:02:12 rsc.publisher.PublisherSkipWhileTest > skipNoneBackpressured STARTED
12-Mar-2019 23:02:12
12-Mar-2019 23:02:12 rsc.publisher.PublisherSkipWhileTest > skipSomeBackpressured STARTED
12-Mar-2019 23:02:12
12-Mar-2019 23:02:12 rsc.publisher.PublisherSkipWhileTest > predicateThrows STARTED
12-Mar-2019 23:02:12
12-Mar-2019 23:02:12 rsc.publisher.PublisherSkipWhileTest > skipAllBackpressured STARTED
12-Mar-2019 23:02:12
12-Mar-2019 23:02:12 rsc.publisher.PublisherSkipWhileTest > skipNone STARTED
12-Mar-2019 23:02:12
12-Mar-2019 23:02:12 rsc.publisher.PublisherSkipWhileTest > skipSome STARTED
12-Mar-2019 23:02:12
12-Mar-2019 23:02:12 rsc.publisher.PublisherSkipWhileTest > skipAll STARTED
12-Mar-2019 23:02:12
12-Mar-2019 23:02:12 rsc.publisher.PublisherElementAtTest > emptyDefaultBackpressured STARTED
12-Mar-2019 23:02:12
12-Mar-2019 23:02:12 rsc.publisher.PublisherElementAtTest > normal5Backpressured STARTED
12-Mar-2019 23:02:12
12-Mar-2019 23:02:12 rsc.publisher.PublisherElementAtTest > normal STARTED
12-Mar-2019 23:02:12
12-Mar-2019 23:02:12 rsc.publisher.PublisherElementAtTest > normalBackpressured STARTED
12-Mar-2019 23:02:12
12-Mar-2019 23:02:12 rsc.publisher.PublisherElementAtTest > normal3Backpressured STARTED
12-Mar-2019 23:02:12
12-Mar-2019 23:02:12 rsc.publisher.PublisherElementAtTest > defaultReturnsNull STARTED
12-Mar-2019 23:02:12
12-Mar-2019 23:02:12 rsc.publisher.PublisherElementAtTest > source1Null STARTED
12-Mar-2019 23:02:12
12-Mar-2019 23:02:12 rsc.publisher.PublisherElementAtTest > source2Null STARTED
12-Mar-2019 23:02:12
12-Mar-2019 23:02:12 rsc.publisher.PublisherElementAtTest > empty STARTED
12-Mar-2019 23:02:12
12-Mar-2019 23:02:12 rsc.publisher.PublisherElementAtTest > nonEmptyDefaultBackpressured STARTED
12-Mar-2019 23:02:12
12-Mar-2019 23:02:12 rsc.publisher.PublisherElementAtTest > defaultThrows STARTED
12-Mar-2019 23:02:12
12-Mar-2019 23:02:12 rsc.publisher.PublisherElementAtTest > emptyDefault STARTED
12-Mar-2019 23:02:12
12-Mar-2019 23:02:12 rsc.publisher.PublisherElementAtTest > nonEmptyDefault STARTED
12-Mar-2019 23:02:12
12-Mar-2019 23:02:12 rsc.publisher.PublisherElementAtTest > defaultSupplierNull STARTED
12-Mar-2019 23:02:12
12-Mar-2019 23:02:12 rsc.publisher.PublisherElementAtTest > normal2 STARTED
12-Mar-2019 23:02:12
12-Mar-2019 23:02:12 rsc.publisher.PublisherElementAtTest > normal3 STARTED
12-Mar-2019 23:02:12
12-Mar-2019 23:02:12 rsc.publisher.PublisherElementAtTest > indexNegative1 STARTED
12-Mar-2019 23:02:12
12-Mar-2019 23:02:12 rsc.publisher.PublisherElementAtTest > indexNegative2 STARTED
12-Mar-2019 23:02:12
12-Mar-2019 23:02:12 rsc.publisher.PublisherAccumulateTest > accumulatorThrows STARTED
12-Mar-2019 23:02:12
12-Mar-2019 23:02:12 rsc.publisher.PublisherAccumulateTest > sourceNull STARTED
12-Mar-2019 23:02:12
12-Mar-2019 23:02:12 rsc.publisher.PublisherAccumulateTest > normal STARTED
12-Mar-2019 23:02:12
12-Mar-2019 23:02:12 rsc.publisher.PublisherAccumulateTest > normalBackpressured STARTED
12-Mar-2019 23:02:12
12-Mar-2019 23:02:12 rsc.publisher.PublisherAccumulateTest > accumulatorNull STARTED
12-Mar-2019 23:02:12
12-Mar-2019 23:02:12 rsc.publisher.PublisherAccumulateTest > accumulatorReturnsNull STARTED
12-Mar-2019 23:02:12
12-Mar-2019 23:02:12 rsc.publisher.ConnectablePublisherProcessTest > constructors STARTED
12-Mar-2019 23:02:12
12-Mar-2019 23:02:12 rsc.publisher.ConnectablePublisherProcessTest > disconnectBackpressured STARTED
12-Mar-2019 23:02:12
12-Mar-2019 23:02:12 rsc.publisher.ConnectablePublisherProcessTest > cancel STARTED
12-Mar-2019 23:02:12
12-Mar-2019 23:02:12 rsc.publisher.ConnectablePublisherProcessTest > normal STARTED
12-Mar-2019 23:02:12
12-Mar-2019 23:02:12 rsc.publisher.ConnectablePublisherProcessTest > normalAsyncFused STARTED
12-Mar-2019 23:02:12
12-Mar-2019 23:02:12 rsc.publisher.ConnectablePublisherProcessTest > error STARTED
12-Mar-2019 23:02:12
12-Mar-2019 23:02:12 rsc.publisher.ConnectablePublisherProcessTest > disconnect STARTED
12-Mar-2019 23:02:12
12-Mar-2019 23:02:12 rsc.publisher.ConnectablePublisherProcessTest > fusedMapInvalid STARTED
12-Mar-2019 23:02:12
12-Mar-2019 23:02:12 rsc.publisher.ConnectablePublisherProcessTest > errorBackpressured STARTED
12-Mar-2019 23:02:12
12-Mar-2019 23:02:12 rsc.publisher.ConnectablePublisherProcessTest > normalProcessorBackpressured STARTED
12-Mar-2019 23:02:12
12-Mar-2019 23:02:12 rsc.publisher.ConnectablePublisherProcessTest > normalBackpressuredAsyncFused STARTED
12-Mar-2019 23:02:12
12-Mar-2019 23:02:12 rsc.publisher.PublisherIntervalTest > constructors STARTED
12-Mar-2019 23:02:12
12-Mar-2019 23:02:12 rsc.publisher.PublisherIntervalTest > normal STARTED
12-Mar-2019 23:02:13
12-Mar-2019 23:02:13 rsc.publisher.PublisherIntervalTest > flatMap STARTED
12-Mar-2019 23:02:18
12-Mar-2019 23:02:18 rsc.publisher.PublisherZipIterableTest > zipperNull STARTED
12-Mar-2019 23:02:18
12-Mar-2019 23:02:18 rsc.publisher.PublisherZipIterableTest > normalSourceShorter STARTED
12-Mar-2019 23:02:18
12-Mar-2019 23:02:18 rsc.publisher.PublisherZipIterableTest > zipperReturnsNull STARTED
12-Mar-2019 23:02:18
12-Mar-2019 23:02:18 rsc.publisher.PublisherZipIterableTest > sourceNull STARTED
12-Mar-2019 23:02:18
12-Mar-2019 23:02:18 rsc.publisher.PublisherZipIterableTest > normalSameSize STARTED
12-Mar-2019 23:02:18
12-Mar-2019 23:02:18 rsc.publisher.PublisherZipIterableTest > iterableReturnsNull STARTED
12-Mar-2019 23:02:18
12-Mar-2019 23:02:18 rsc.publisher.PublisherZipIterableTest > normalSameSizeBackpressured STARTED
12-Mar-2019 23:02:18
12-Mar-2019 23:02:18 rsc.publisher.PublisherZipIterableTest > otherEmpty STARTED
12-Mar-2019 23:02:18
12-Mar-2019 23:02:18 rsc.publisher.PublisherZipIterableTest > sourceEmpty STARTED
12-Mar-2019 23:02:18
12-Mar-2019 23:02:18 rsc.publisher.PublisherZipIterableTest > normalOtherShorter STARTED
12-Mar-2019 23:02:18
12-Mar-2019 23:02:18 rsc.publisher.PublisherZipIterableTest > zipperThrowsNull STARTED
12-Mar-2019 23:02:18
12-Mar-2019 23:02:18 rsc.publisher.PublisherZipIterableTest > iterableNull STARTED
12-Mar-2019 23:02:18
12-Mar-2019 23:02:18 rsc.publisher.PublisherZipIterableTest > iterableThrowsNull STARTED
12-Mar-2019 23:02:18
12-Mar-2019 23:02:18 rsc.publisher.PublisherPublishTest > subsequentSum STARTED
12-Mar-2019 23:02:18
12-Mar-2019 23:02:18 rsc.publisher.PublisherPublishTest > cancelComposes2 STARTED
12-Mar-2019 23:02:18
12-Mar-2019 23:02:18 rsc.publisher.PublisherPublishTest > subsequentSumHidden STARTED
12-Mar-2019 23:02:18
12-Mar-2019 23:02:18 rsc.publisher.PublisherPublishTest > subsequentSumAsync STARTED
12-Mar-2019 23:02:18
12-Mar-2019 23:02:18 rsc.publisher.PublisherPublishTest > innerCanFuse STARTED
12-Mar-2019 23:02:18
12-Mar-2019 23:02:18 rsc.publisher.PublisherPublishTest > cancelComposes STARTED
12-Mar-2019 23:02:18
12-Mar-2019 23:02:18 rsc.publisher.PublisherDefaultIfEmptyTest > nonEmptyBackpressured STARTED
12-Mar-2019 23:02:18
12-Mar-2019 23:02:18 rsc.publisher.PublisherDefaultIfEmptyTest > sourceNull STARTED
12-Mar-2019 23:02:18
12-Mar-2019 23:02:18 rsc.publisher.PublisherDefaultIfEmptyTest > valueNull STARTED
12-Mar-2019 23:02:18
12-Mar-2019 23:02:18 rsc.publisher.PublisherDefaultIfEmptyTest > emptyBackpressured STARTED
12-Mar-2019 23:02:18
12-Mar-2019 23:02:18 rsc.publisher.PublisherDefaultIfEmptyTest > empty STARTED
12-Mar-2019 23:02:18
12-Mar-2019 23:02:18 rsc.publisher.PublisherDefaultIfEmptyTest > nonEmpty STARTED
12-Mar-2019 23:02:18
12-Mar-2019 23:02:18 rsc.publisher.PublisherCallableTest > normal STARTED
12-Mar-2019 23:02:18
12-Mar-2019 23:02:18 rsc.publisher.PublisherCallableTest > normalBackpressured STARTED
12-Mar-2019 23:02:18
12-Mar-2019 23:02:18 rsc.publisher.PublisherCallableTest > nullCallable STARTED
12-Mar-2019 23:02:18
12-Mar-2019 23:02:18 rsc.publisher.PublisherCallableTest > callableThrows STARTED
12-Mar-2019 23:02:18
12-Mar-2019 23:02:18 rsc.publisher.PublisherCallableTest > callableReturnsNull STARTED
12-Mar-2019 23:02:18
12-Mar-2019 23:02:18 rsc.publisher.PublisherOnAssemblyTest > checkNotRecorded STARTED
12-Mar-2019 23:02:18
12-Mar-2019 23:02:18 rsc.publisher.PublisherOnAssemblyTest > checkRecorded STARTED
12-Mar-2019 23:02:18
12-Mar-2019 23:02:18 rsc.publisher.PublisherSampleTest > otherNull STARTED
12-Mar-2019 23:02:18
12-Mar-2019 23:02:18 rsc.publisher.PublisherSampleTest > otherCompletesImmediately STARTED
12-Mar-2019 23:02:18
12-Mar-2019 23:02:18 rsc.publisher.PublisherSampleTest > error1 STARTED
12-Mar-2019 23:02:18
12-Mar-2019 23:02:18 rsc.publisher.PublisherSampleTest > error2 STARTED
12-Mar-2019 23:02:18
12-Mar-2019 23:02:18 rsc.publisher.PublisherSampleTest > subscriberCancels STARTED
12-Mar-2019 23:02:18
12-Mar-2019 23:02:18 rsc.publisher.PublisherSampleTest > sourceNull STARTED
12-Mar-2019 23:02:18
12-Mar-2019 23:02:18 rsc.publisher.PublisherSampleTest > mainCompletesImmediately STARTED
12-Mar-2019 23:02:18
12-Mar-2019 23:02:18 rsc.publisher.PublisherSampleTest > normal1 STARTED
12-Mar-2019 23:02:18
12-Mar-2019 23:02:18 rsc.publisher.PublisherSampleTest > normal2 STARTED
12-Mar-2019 23:02:18
12-Mar-2019 23:02:18 rsc.publisher.PublisherBufferBoundaryTest > constructors STARTED
12-Mar-2019 23:02:18
12-Mar-2019 23:02:18 rsc.publisher.PublisherBufferBoundaryTest > bufferSupplierReturnsNUll STARTED
12-Mar-2019 23:02:18
12-Mar-2019 23:02:18 rsc.publisher.PublisherBufferBoundaryTest > normal STARTED
12-Mar-2019 23:02:18
12-Mar-2019 23:02:18 rsc.publisher.PublisherBufferBoundaryTest > bufferSupplierThrows STARTED
12-Mar-2019 23:02:18
12-Mar-2019 23:02:18 rsc.publisher.PublisherBufferBoundaryTest > mainError STARTED
12-Mar-2019 23:02:18
12-Mar-2019 23:02:18 rsc.publisher.PublisherBufferBoundaryTest > otherError STARTED
12-Mar-2019 23:02:18
12-Mar-2019 23:02:18 rsc.publisher.PublisherBufferBoundaryTest > bufferSupplierThrowsLater STARTED
12-Mar-2019 23:02:18
12-Mar-2019 23:02:18 rsc.publisher.PublisherBufferBoundaryAndSizeTest > constructors STARTED
12-Mar-2019 23:02:18
12-Mar-2019 23:02:18 rsc.publisher.PublisherBufferBoundaryAndSizeTest > mixed STARTED
12-Mar-2019 23:02:18
12-Mar-2019 23:02:18 rsc.publisher.PublisherBufferBoundaryAndSizeTest > withMaxSize STARTED
12-Mar-2019 23:02:18
12-Mar-2019 23:02:18 rsc.publisher.PublisherWindowBatchTest > constructors STARTED
12-Mar-2019 23:02:18
12-Mar-2019 23:02:18 rsc.publisher.PublisherWindowBatchTest > windowBatching STARTED
12-Mar-2019 23:02:20
12-Mar-2019 23:02:20 rsc.publisher.PublisherWindowBatchTest > normal STARTED
12-Mar-2019 23:02:20
12-Mar-2019 23:02:20 rsc.publisher.PublisherWindowBatchTest > normalSameLast STARTED
12-Mar-2019 23:02:20
12-Mar-2019 23:02:20 rsc.publisher.PublisherAmbTest > iterableOneIsNullSource STARTED
12-Mar-2019 23:02:20
12-Mar-2019 23:02:20 rsc.publisher.PublisherAmbTest > arrayNull STARTED
12-Mar-2019 23:02:20
12-Mar-2019 23:02:20 rsc.publisher.PublisherAmbTest > singleIterableNullSource STARTED
12-Mar-2019 23:02:20
12-Mar-2019 23:02:20 rsc.publisher.PublisherAmbTest > firstWinner STARTED
12-Mar-2019 23:02:20
12-Mar-2019 23:02:20 rsc.publisher.PublisherAmbTest > secondWinner STARTED
12-Mar-2019 23:02:20
12-Mar-2019 23:02:20 rsc.publisher.PublisherAmbTest > arrayOneIsNullSource STARTED
12-Mar-2019 23:02:20
12-Mar-2019 23:02:20 rsc.publisher.PublisherAmbTest > singleArrayNullSource STARTED
12-Mar-2019 23:02:20
12-Mar-2019 23:02:20 rsc.publisher.PublisherAmbTest > secondEmitsError STARTED
12-Mar-2019 23:02:20
12-Mar-2019 23:02:20 rsc.publisher.PublisherAmbTest > firstWinnerBackpressured STARTED
12-Mar-2019 23:02:20
12-Mar-2019 23:02:20 rsc.publisher.PublisherAmbTest > iterableNull STARTED
12-Mar-2019 23:02:20
12-Mar-2019 23:02:20 rsc.publisher.PublisherFutureTest > constructors STARTED
12-Mar-2019 23:02:20
12-Mar-2019 23:02:20 rsc.publisher.PublisherFutureTest > timeout STARTED
12-Mar-2019 23:02:20
12-Mar-2019 23:02:20 rsc.publisher.PublisherFutureTest > noCrossCancel STARTED
12-Mar-2019 23:02:21
12-Mar-2019 23:02:21 rsc.publisher.PublisherFutureTest > normal STARTED
12-Mar-2019 23:02:21
12-Mar-2019 23:02:21 rsc.publisher.PublisherFutureTest > normalBackpressured STARTED
12-Mar-2019 23:02:22
12-Mar-2019 23:02:22 rsc.publisher.PublisherFutureTest > futureThrows STARTED
12-Mar-2019 23:02:23
12-Mar-2019 23:02:23 rsc.publisher.ConnectablePublisherPublishTest > constructors STARTED
12-Mar-2019 23:02:23
12-Mar-2019 23:02:23 rsc.publisher.ConnectablePublisherPublishTest > disconnectBackpressured STARTED
12-Mar-2019 23:02:23
12-Mar-2019 23:02:23 rsc.publisher.ConnectablePublisherPublishTest > normal STARTED
12-Mar-2019 23:02:23
12-Mar-2019 23:02:23 rsc.publisher.ConnectablePublisherPublishTest > normalBackpressured STARTED
12-Mar-2019 23:02:23
12-Mar-2019 23:02:23 rsc.publisher.ConnectablePublisherPublishTest > normalAsyncFused STARTED
12-Mar-2019 23:02:23
12-Mar-2019 23:02:23 rsc.publisher.ConnectablePublisherPublishTest > normalHidden STARTED
12-Mar-2019 23:02:23
12-Mar-2019 23:02:23 rsc.publisher.ConnectablePublisherPublishTest > error STARTED
12-Mar-2019 23:02:23
12-Mar-2019 23:02:23 rsc.publisher.ConnectablePublisherPublishTest > disconnect STARTED
12-Mar-2019 23:02:23
12-Mar-2019 23:02:23 rsc.publisher.ConnectablePublisherPublishTest > fusedMapInvalid STARTED
12-Mar-2019 23:02:23
12-Mar-2019 23:02:23 rsc.publisher.ConnectablePublisherPublishTest > normalHiddenBackpressured STARTED
12-Mar-2019 23:02:23
12-Mar-2019 23:02:23 rsc.publisher.ConnectablePublisherPublishTest > normalBackpressuredAsyncFused STARTED
12-Mar-2019 23:02:23
12-Mar-2019 23:02:23 rsc.publisher.PublisherThrottleFirstTest > constructors STARTED
12-Mar-2019 23:02:23
12-Mar-2019 23:02:23 rsc.publisher.PublisherThrottleFirstTest > throttlerError STARTED
12-Mar-2019 23:02:23
12-Mar-2019 23:02:23 rsc.publisher.PublisherThrottleFirstTest > normal STARTED
12-Mar-2019 23:02:23
12-Mar-2019 23:02:23 rsc.publisher.PublisherThrottleFirstTest > throttlerReturnsNull STARTED
12-Mar-2019 23:02:23
12-Mar-2019 23:02:23 rsc.publisher.PublisherThrottleFirstTest > throttlerThrows STARTED
12-Mar-2019 23:02:23
12-Mar-2019 23:02:23 rsc.publisher.PublisherThrottleFirstTest > mainError STARTED
12-Mar-2019 23:02:23
12-Mar-2019 23:02:23 rsc.publisher.BlockingTest > blockingFirst STARTED
12-Mar-2019 23:02:23
12-Mar-2019 23:02:23 rsc.publisher.BlockingTest > blockingLast STARTED
12-Mar-2019 23:02:23
12-Mar-2019 23:02:23 rsc.publisher.BlockingTest > peekLastSync STARTED
12-Mar-2019 23:02:23
12-Mar-2019 23:02:23 rsc.publisher.PublisherRetryPredicateTest > sourceNull STARTED
12-Mar-2019 23:02:23
12-Mar-2019 23:02:23 rsc.publisher.PublisherRetryPredicateTest > normal STARTED
12-Mar-2019 23:02:23
12-Mar-2019 23:02:23 rsc.publisher.PublisherRetryPredicateTest > predicateNull STARTED
12-Mar-2019 23:02:23
12-Mar-2019 23:02:23 rsc.publisher.PublisherRetryPredicateTest > normalBackpressured STARTED
12-Mar-2019 23:02:23
12-Mar-2019 23:02:23 rsc.publisher.PublisherRetryPredicateTest > dontRepeat STARTED
12-Mar-2019 23:02:23
12-Mar-2019 23:02:23 rsc.publisher.PublisherRetryPredicateTest > predicateThrows STARTED
12-Mar-2019 23:02:23
12-Mar-2019 23:02:23 rsc.publisher.PublisherJustTest > normal STARTED
12-Mar-2019 23:02:23
12-Mar-2019 23:02:23 rsc.publisher.PublisherJustTest > normalBackpressured STARTED
12-Mar-2019 23:02:23
12-Mar-2019 23:02:23 rsc.publisher.PublisherJustTest > valueSame STARTED
12-Mar-2019 23:02:23
12-Mar-2019 23:02:23 rsc.publisher.PublisherJustTest > fused STARTED
12-Mar-2019 23:02:23
12-Mar-2019 23:02:23 rsc.publisher.PublisherJustTest > nullValue STARTED
12-Mar-2019 23:02:23
12-Mar-2019 23:02:23 rsc.publisher.PublisherHasElementsTest > sourceNull STARTED
12-Mar-2019 23:02:23
12-Mar-2019 23:02:23 rsc.publisher.PublisherHasElementsTest > nonEmptySourceBackpressured STARTED
12-Mar-2019 23:02:23
12-Mar-2019 23:02:23 rsc.publisher.PublisherHasElementsTest > emptySourceBackpressured STARTED
12-Mar-2019 23:02:23
12-Mar-2019 23:02:23 rsc.publisher.PublisherHasElementsTest > emptySource STARTED
12-Mar-2019 23:02:23
12-Mar-2019 23:02:23 rsc.publisher.PublisherHasElementsTest > nonEmptySource STARTED
12-Mar-2019 23:02:23
12-Mar-2019 23:02:23 rsc.publisher.PublisherAwaitOnSubscribeTest > cancelDelayed STARTED
12-Mar-2019 23:02:23
12-Mar-2019 23:02:23 rsc.publisher.PublisherAwaitOnSubscribeTest > requestDelayed STARTED
12-Mar-2019 23:02:23
12-Mar-2019 23:02:23 rsc.publisher.PublisherAwaitOnSubscribeTest > cancelNotDelayed STARTED
12-Mar-2019 23:02:23
12-Mar-2019 23:02:23 rsc.publisher.PublisherAwaitOnSubscribeTest > requestNotDelayed STARTED
12-Mar-2019 23:02:23
12-Mar-2019 23:02:23 rsc.publisher.PublisherAllTest > sourceNull STARTED
12-Mar-2019 23:02:23
12-Mar-2019 23:02:23 rsc.publisher.PublisherAllTest > normal STARTED
12-Mar-2019 23:02:23
12-Mar-2019 23:02:23 rsc.publisher.PublisherAllTest > predicateNull STARTED
12-Mar-2019 23:02:23
12-Mar-2019 23:02:23 rsc.publisher.PublisherAllTest > normalBackpressured STARTED
12-Mar-2019 23:02:23
12-Mar-2019 23:02:23 rsc.publisher.PublisherAllTest > someMatch STARTED
12-Mar-2019 23:02:23
12-Mar-2019 23:02:23 rsc.publisher.PublisherAllTest > someMatchBackpressured STARTED
12-Mar-2019 23:02:23
12-Mar-2019 23:02:23 rsc.publisher.PublisherAllTest > predicateThrows STARTED
12-Mar-2019 23:02:23
12-Mar-2019 23:02:23 rsc.publisher.PublisherSwitchIfEmptyTest > otherNull STARTED
12-Mar-2019 23:02:23
12-Mar-2019 23:02:23 rsc.publisher.PublisherSwitchIfEmptyTest > nonEmptyBackpressured STARTED
12-Mar-2019 23:02:23
12-Mar-2019 23:02:23 rsc.publisher.PublisherSwitchIfEmptyTest > sourceNull STARTED
12-Mar-2019 23:02:23
12-Mar-2019 23:02:23 rsc.publisher.PublisherSwitchIfEmptyTest > emptyBackpressured STARTED
12-Mar-2019 23:02:23
12-Mar-2019 23:02:23 rsc.publisher.PublisherSwitchIfEmptyTest > empty STARTED
12-Mar-2019 23:02:23
12-Mar-2019 23:02:23 rsc.publisher.PublisherSwitchIfEmptyTest > nonEmpty STARTED
12-Mar-2019 23:02:23
12-Mar-2019 23:02:23 rsc.publisher.PublisherGroupByTest > backpressure STARTED
12-Mar-2019 23:02:23
12-Mar-2019 23:02:23 rsc.publisher.PublisherGroupByTest > constructors STARTED
12-Mar-2019 23:02:23
12-Mar-2019 23:02:23 rsc.publisher.PublisherGroupByTest > valueSelectorNull STARTED
12-Mar-2019 23:02:23
12-Mar-2019 23:02:23 rsc.publisher.PublisherGroupByTest > twoGroupsLongAsyncMergeHidden STARTED
12-Mar-2019 23:02:23
12-Mar-2019 23:02:23 rsc.publisher.PublisherGroupByTest > twoGroupsLongAsyncMergeLoop STARTED
12-Mar-2019 23:02:36
12-Mar-2019 23:02:36 rsc.publisher.PublisherGroupByTest > twoGroupsFullAsync STARTED
12-Mar-2019 23:02:36
12-Mar-2019 23:02:36 rsc.publisher.PublisherGroupByTest > normal STARTED
12-Mar-2019 23:02:36
12-Mar-2019 23:02:36 rsc.publisher.PublisherGroupByTest > concatMapBackHidden STARTED
12-Mar-2019 23:02:36
12-Mar-2019 23:02:36 rsc.publisher.PublisherGroupByTest > twoGroupsLongMergeHidden STARTED
12-Mar-2019 23:02:37
12-Mar-2019 23:02:37 rsc.publisher.PublisherGroupByTest > concatMapBack STARTED
12-Mar-2019 23:02:37
12-Mar-2019 23:02:37 rsc.publisher.PublisherGroupByTest > takeTwoGroupsOnly STARTED
12-Mar-2019 23:02:37
12-Mar-2019 23:02:37 rsc.publisher.PublisherGroupByTest > oneGroupLongMerge STARTED
12-Mar-2019 23:02:37
12-Mar-2019 23:02:37 rsc.publisher.PublisherGroupByTest > twoGroupsFullAsyncFullHide STARTED
12-Mar-2019 23:02:37
12-Mar-2019 23:02:37 rsc.publisher.PublisherGroupByTest > empty STARTED
12-Mar-2019 23:02:37
12-Mar-2019 23:02:37 rsc.publisher.PublisherGroupByTest > error STARTED
12-Mar-2019 23:02:37
12-Mar-2019 23:02:37 rsc.publisher.PublisherGroupByTest > twoGroupsConsumeWithSubscribe STARTED
12-Mar-2019 23:02:38
12-Mar-2019 23:02:38 rsc.publisher.PublisherGroupByTest > groupsCompleteAsSoonAsMainCompletesNoFusion STARTED
12-Mar-2019 23:02:38
12-Mar-2019 23:02:38 rsc.publisher.PublisherGroupByTest > keySelectorNull STARTED
12-Mar-2019 23:02:38
12-Mar-2019 23:02:38 rsc.publisher.PublisherGroupByTest > oneGroupLongMergeHidden STARTED
12-Mar-2019 23:02:38
12-Mar-2019 23:02:38 rsc.publisher.PublisherGroupByTest > twoGroupsLongMerge STARTED
12-Mar-2019 23:02:38
12-Mar-2019 23:02:38 rsc.publisher.PublisherGroupByTest > twoGroupsConsumeWithSubscribePrefetchSmaller STARTED
12-Mar-2019 23:02:38
12-Mar-2019 23:02:38 rsc.publisher.PublisherGroupByTest > normalValueSelector STARTED
12-Mar-2019 23:02:38
12-Mar-2019 23:02:38 rsc.publisher.PublisherGroupByTest > flatMapBack STARTED
12-Mar-2019 23:02:38
12-Mar-2019 23:02:38 rsc.publisher.PublisherGroupByTest > twoGroupsLongAsyncMergeHiddenLoop STARTED
12-Mar-2019 23:02:55
12-Mar-2019 23:02:55 rsc.publisher.PublisherGroupByTest > twoGroupsConsumeWithSubscribeHide STARTED
12-Mar-2019 23:02:56
12-Mar-2019 23:02:56 rsc.publisher.PublisherGroupByTest > twoGroupsConsumeWithSubscribePrefetchBigger STARTED
12-Mar-2019 23:02:56
12-Mar-2019 23:02:56 rsc.publisher.PublisherGroupByTest > groupsCompleteAsSoonAsMainCompletes STARTED
12-Mar-2019 23:02:56
12-Mar-2019 23:02:56 rsc.publisher.PublisherGroupByTest > twoGroupsLongAsyncMerge STARTED
12-Mar-2019 23:02:56
12-Mar-2019 23:02:56 rsc.publisher.PublisherGroupByTest > flatMapBackHidden STARTED
12-Mar-2019 23:02:56
12-Mar-2019 23:02:56 rsc.publisher.PublisherScanTest > accumulatorThrows STARTED
12-Mar-2019 23:02:56
12-Mar-2019 23:02:56 rsc.publisher.PublisherScanTest > sourceNull STARTED
12-Mar-2019 23:02:56
12-Mar-2019 23:02:56 rsc.publisher.PublisherScanTest > normal STARTED
12-Mar-2019 23:02:56
12-Mar-2019 23:02:56 rsc.publisher.PublisherScanTest > initialValueNull STARTED
12-Mar-2019 23:02:56
12-Mar-2019 23:02:56 rsc.publisher.PublisherScanTest > normalBackpressured STARTED
12-Mar-2019 23:02:56
12-Mar-2019 23:02:56 rsc.publisher.PublisherScanTest > accumulatorNull STARTED
12-Mar-2019 23:02:56
12-Mar-2019 23:02:56 rsc.publisher.PublisherScanTest > accumulatorReturnsNull STARTED
12-Mar-2019 23:02:56
12-Mar-2019 23:02:56 rsc.publisher.PublisherRepeatPredicateTest > sourceNull STARTED
12-Mar-2019 23:02:56
12-Mar-2019 23:02:56 rsc.publisher.PublisherRepeatPredicateTest > normal STARTED
12-Mar-2019 23:02:56
12-Mar-2019 23:02:56 rsc.publisher.PublisherRepeatPredicateTest > predicateNull STARTED
12-Mar-2019 23:02:56
12-Mar-2019 23:02:56 rsc.publisher.PublisherRepeatPredicateTest > normalBackpressured STARTED
12-Mar-2019 23:02:56
12-Mar-2019 23:02:56 rsc.publisher.PublisherRepeatPredicateTest > dontRepeat STARTED
12-Mar-2019 23:02:56
12-Mar-2019 23:02:56 rsc.publisher.PublisherRepeatPredicateTest > predicateThrows STARTED
12-Mar-2019 23:02:56
12-Mar-2019 23:02:56 rsc.publisher.PublisherResumeTest > someFirstBackpressured STARTED
12-Mar-2019 23:02:56
12-Mar-2019 23:02:56 rsc.publisher.PublisherResumeTest > constructors STARTED
12-Mar-2019 23:02:56
12-Mar-2019 23:02:56 rsc.publisher.PublisherResumeTest > nextFactoryReturnsNull STARTED
12-Mar-2019 23:02:56
12-Mar-2019 23:02:56 rsc.publisher.PublisherResumeTest > nextFactoryThrows STARTED
12-Mar-2019 23:02:56
12-Mar-2019 23:02:56 rsc.publisher.PublisherResumeTest > normal STARTED
12-Mar-2019 23:02:56
12-Mar-2019 23:02:56 rsc.publisher.PublisherResumeTest > normalBackpressured STARTED
12-Mar-2019 23:02:56
12-Mar-2019 23:02:56 rsc.publisher.PublisherResumeTest > someFirst STARTED
12-Mar-2019 23:02:56
12-Mar-2019 23:02:56 rsc.publisher.PublisherResumeTest > error STARTED
12-Mar-2019 23:02:56
12-Mar-2019 23:02:56 rsc.publisher.PublisherResumeTest > errorBackpressured STARTED
12-Mar-2019 23:02:56
12-Mar-2019 23:02:56 rsc.publisher.PublisherErrorTest > normal STARTED
12-Mar-2019 23:02:56
12-Mar-2019 23:02:56 rsc.publisher.PublisherErrorTest > supplierThrows STARTED
12-Mar-2019 23:02:56
12-Mar-2019 23:02:56 rsc.publisher.PublisherErrorTest > normalSupplier STARTED
12-Mar-2019 23:02:56
12-Mar-2019 23:02:56 rsc.publisher.PublisherErrorTest > errorNull STARTED
12-Mar-2019 23:02:56
12-Mar-2019 23:02:56 rsc.publisher.PublisherErrorTest > supplierReturnsNull STARTED
12-Mar-2019 23:02:56
12-Mar-2019 23:02:56 rsc.publisher.PublisherErrorTest > whenRequested STARTED
12-Mar-2019 23:02:56
12-Mar-2019 23:02:56 rsc.publisher.PublisherErrorTest > supplierNull STARTED
12-Mar-2019 23:02:56
12-Mar-2019 23:02:56 rsc.publisher.PublisherReduceTest > accumulatorThrows STARTED
12-Mar-2019 23:02:56
12-Mar-2019 23:02:56 rsc.publisher.PublisherReduceTest > sourceNull STARTED
12-Mar-2019 23:02:56
12-Mar-2019 23:02:56 rsc.publisher.PublisherReduceTest > normal STARTED
12-Mar-2019 23:02:56
12-Mar-2019 23:02:56 rsc.publisher.PublisherReduceTest > normalBackpressured STARTED
12-Mar-2019 23:02:56
12-Mar-2019 23:02:56 rsc.publisher.PublisherReduceTest > accumulatorNull STARTED
12-Mar-2019 23:02:56
12-Mar-2019 23:02:56 rsc.publisher.PublisherReduceTest > supplierThrows STARTED
12-Mar-2019 23:02:56
12-Mar-2019 23:02:56 rsc.publisher.PublisherReduceTest > supplierReturnsNull STARTED
12-Mar-2019 23:02:56
12-Mar-2019 23:02:56 rsc.publisher.PublisherReduceTest > accumulatorReturnsNull STARTED
12-Mar-2019 23:02:56
12-Mar-2019 23:02:56 rsc.publisher.PublisherReduceTest > supplierNull STARTED
12-Mar-2019 23:02:56
12-Mar-2019 23:02:56 rsc.publisher.PublisherTakeUntilPredicateTest > takeAll STARTED
12-Mar-2019 23:02:56
12-Mar-2019 23:02:56 rsc.publisher.PublisherTakeUntilPredicateTest > sourceNull STARTED
12-Mar-2019 23:02:56
12-Mar-2019 23:02:56 rsc.publisher.PublisherTakeUntilPredicateTest > predicateNull STARTED
12-Mar-2019 23:02:56
12-Mar-2019 23:02:56 rsc.publisher.PublisherTakeUntilPredicateTest > takeSome STARTED
12-Mar-2019 23:02:56
12-Mar-2019 23:02:56 rsc.publisher.PublisherTakeUntilPredicateTest > stopImmediatelyBackpressured STARTED
12-Mar-2019 23:02:56
12-Mar-2019 23:02:56 rsc.publisher.PublisherTakeUntilPredicateTest > takeSomeBackpressured STARTED
12-Mar-2019 23:02:56
12-Mar-2019 23:02:56 rsc.publisher.PublisherTakeUntilPredicateTest > takeAllBackpressured STARTED
12-Mar-2019 23:02:56
12-Mar-2019 23:02:56 rsc.publisher.PublisherTakeUntilPredicateTest > predicateThrows STARTED
12-Mar-2019 23:02:56
12-Mar-2019 23:02:56 rsc.publisher.PublisherTakeUntilPredicateTest > stopImmediately STARTED
12-Mar-2019 23:02:56
12-Mar-2019 23:02:56 rsc.publisher.PublisherTakeUntilTest > takeAll STARTED
12-Mar-2019 23:02:56
12-Mar-2019 23:02:56 rsc.publisher.PublisherTakeUntilTest > otherSignalsErrorBackpressured STARTED
12-Mar-2019 23:02:56
12-Mar-2019 23:02:56 rsc.publisher.PublisherTakeUntilTest > takeNone STARTED
12-Mar-2019 23:02:56
12-Mar-2019 23:02:56 rsc.publisher.PublisherTakeUntilTest > takeNoneBackpressured STARTED
12-Mar-2019 23:02:56
12-Mar-2019 23:02:56 rsc.publisher.PublisherTakeUntilTest > takeNoneBackpressuredOtherMany STARTED
12-Mar-2019 23:02:56
12-Mar-2019 23:02:56 rsc.publisher.PublisherTakeUntilTest > otherSignalsError STARTED
12-Mar-2019 23:02:56
12-Mar-2019 23:02:56 rsc.publisher.PublisherTakeUntilTest > takeNoneOtherMany STARTED
12-Mar-2019 23:02:56
12-Mar-2019 23:02:56 rsc.publisher.PublisherTakeUntilTest > takeAllBackpressured STARTED
12-Mar-2019 23:02:56
12-Mar-2019 23:02:56 rsc.publisher.PublisherTakeUntilTest > nullOther STARTED
12-Mar-2019 23:02:56
12-Mar-2019 23:02:56 rsc.publisher.PublisherTakeUntilTest > nullSource STARTED
12-Mar-2019 23:02:56
12-Mar-2019 23:02:56 rsc.publisher.PublisherRetryWhenTest > retryAlways STARTED
12-Mar-2019 23:02:56
12-Mar-2019 23:02:56 rsc.publisher.PublisherRetryWhenTest > sourceNull STARTED
12-Mar-2019 23:02:56
12-Mar-2019 23:02:56 rsc.publisher.PublisherRetryWhenTest > coldRepeaterBackpressured STARTED
12-Mar-2019 23:02:56
12-Mar-2019 23:02:56 rsc.publisher.PublisherRetryWhenTest > whenFactoryThrows STARTED
12-Mar-2019 23:02:56
12-Mar-2019 23:02:56 rsc.publisher.PublisherRetryWhenTest > repeaterErrorsInResponse STARTED
12-Mar-2019 23:02:56
12-Mar-2019 23:02:56 rsc.publisher.PublisherRetryWhenTest > whenFactoryNull STARTED
12-Mar-2019 23:02:56
12-Mar-2019 23:02:56 rsc.publisher.PublisherRetryWhenTest > coldEmpty STARTED
12-Mar-2019 23:02:56
12-Mar-2019 23:02:56 rsc.publisher.PublisherRetryWhenTest > coldError STARTED
12-Mar-2019 23:02:56
12-Mar-2019 23:02:56 rsc.publisher.PublisherRetryWhenTest > coldRepeater STARTED
12-Mar-2019 23:02:56
12-Mar-2019 23:02:56 rsc.publisher.PublisherRetryWhenTest > whenFactoryReturnsNull STARTED
12-Mar-2019 23:02:56
12-Mar-2019 23:02:56 rsc.processor.UnicastProcessorTest > normalLive STARTED
12-Mar-2019 23:02:56
12-Mar-2019 23:02:56 rsc.processor.UnicastProcessorTest > subscribeOnNextRace STARTED
12-Mar-2019 23:02:58
12-Mar-2019 23:02:58 rsc.processor.UnicastProcessorTest > subscribeOnNextRaceFusedSpin1 STARTED
12-Mar-2019 23:03:00
12-Mar-2019 23:03:00 rsc.processor.UnicastProcessorTest > subscribeOnNextRaceFusedSpin2 STARTED
12-Mar-2019 23:03:01
12-Mar-2019 23:03:01 rsc.processor.UnicastProcessorTest > subscribeOnNextRaceFusedSpin3 STARTED
12-Mar-2019 23:03:01
12-Mar-2019 23:03:01 rsc.processor.UnicastProcessorTest > subscribeOnNextRaceFusedSpin4 STARTED
12-Mar-2019 23:03:02
12-Mar-2019 23:03:02 rsc.processor.UnicastProcessorTest > subscribeOnNextRaceFused STARTED
12-Mar-2019 23:03:04
12-Mar-2019 23:03:04 rsc.processor.UnicastProcessorTest > secondSubscriberRejectedProperly STARTED
12-Mar-2019 23:03:04
12-Mar-2019 23:03:04 rsc.processor.UnicastProcessorTest > normalOffline STARTED
12-Mar-2019 23:03:04
12-Mar-2019 23:03:04 rsc.processor.AsyncProcessorTest > onlineFuseable STARTED
12-Mar-2019 23:03:04
12-Mar-2019 23:03:04 rsc.processor.AsyncProcessorTest > offlineEmpty STARTED
12-Mar-2019 23:03:04
12-Mar-2019 23:03:04 rsc.processor.AsyncProcessorTest > offlineError STARTED
12-Mar-2019 23:03:04
12-Mar-2019 23:03:04 rsc.processor.AsyncProcessorTest > offline STARTED
12-Mar-2019 23:03:04
12-Mar-2019 23:03:04 rsc.processor.AsyncProcessorTest > offlineErrorFused STARTED
12-Mar-2019 23:03:04
12-Mar-2019 23:03:04 rsc.processor.AsyncProcessorTest > online STARTED
12-Mar-2019 23:03:04
12-Mar-2019 23:03:04 rsc.processor.AsyncProcessorTest > onlineBackpressured STARTED
12-Mar-2019 23:03:04
12-Mar-2019 23:03:04 rsc.processor.AsyncProcessorTest > onlineEmptyFused STARTED
12-Mar-2019 23:03:04
12-Mar-2019 23:03:04 rsc.processor.AsyncProcessorTest > offlineBackpressured STARTED
12-Mar-2019 23:03:04
12-Mar-2019 23:03:04 rsc.processor.AsyncProcessorTest > offlineEmptyFused STARTED
12-Mar-2019 23:03:04
12-Mar-2019 23:03:04 rsc.processor.AsyncProcessorTest > onlineEmpty STARTED
12-Mar-2019 23:03:04
12-Mar-2019 23:03:04 rsc.processor.AsyncProcessorTest > onlineError STARTED
12-Mar-2019 23:03:04
12-Mar-2019 23:03:04 rsc.processor.AsyncProcessorTest > offlineFuseable STARTED
12-Mar-2019 23:03:04
12-Mar-2019 23:03:04 rsc.processor.AsyncProcessorTest > offlineFuseableBackpressured STARTED
12-Mar-2019 23:03:04
12-Mar-2019 23:03:04 rsc.processor.AsyncProcessorTest > onlineErrorFused STARTED
12-Mar-2019 23:03:04
12-Mar-2019 23:03:04 rsc.processor.ReplayProcessorTest > fusedBoundedLong STARTED
12-Mar-2019 23:03:04
12-Mar-2019 23:03:04 rsc.processor.ReplayProcessorTest > boundedLong STARTED
12-Mar-2019 23:03:04
12-Mar-2019 23:03:04 rsc.processor.ReplayProcessorTest > cancel STARTED
12-Mar-2019 23:03:04
12-Mar-2019 23:03:04 rsc.processor.ReplayProcessorTest > unboundedAfter STARTED
12-Mar-2019 23:03:04
12-Mar-2019 23:03:04 rsc.processor.ReplayProcessorTest > boundedAfter STARTED
12-Mar-2019 23:03:04
12-Mar-2019 23:03:04 rsc.processor.ReplayProcessorTest > unboundedLong STARTED
12-Mar-2019 23:03:04
12-Mar-2019 23:03:04 rsc.processor.ReplayProcessorTest > bounded STARTED
12-Mar-2019 23:03:04
12-Mar-2019 23:03:04 rsc.processor.ReplayProcessorTest > fusedBoundedAfterLong STARTED
12-Mar-2019 23:03:04
12-Mar-2019 23:03:04 rsc.processor.ReplayProcessorTest > fusedUnboundedAfterLong STARTED
12-Mar-2019 23:03:04
12-Mar-2019 23:03:04 rsc.processor.ReplayProcessorTest > fusedUnboundedLong STARTED
12-Mar-2019 23:03:04
12-Mar-2019 23:03:04 rsc.processor.ReplayProcessorTest > unbounded STARTED
12-Mar-2019 23:03:04
12-Mar-2019 23:03:04 rsc.processor.DirectProcessorTest > onSubscribeNull STARTED
12-Mar-2019 23:03:04
12-Mar-2019 23:03:04 rsc.processor.DirectProcessorTest > subscriberCancels STARTED
12-Mar-2019 23:03:04
12-Mar-2019 23:03:04 rsc.processor.DirectProcessorTest > normal STARTED
12-Mar-2019 23:03:04
12-Mar-2019 23:03:04 rsc.processor.DirectProcessorTest > terminatedNormally STARTED
12-Mar-2019 23:03:04
12-Mar-2019 23:03:04 rsc.processor.DirectProcessorTest > normalBackpressured STARTED
12-Mar-2019 23:03:04
12-Mar-2019 23:03:04 rsc.processor.DirectProcessorTest > subscriberAlreadyCancelled STARTED
12-Mar-2019 23:03:04
12-Mar-2019 23:03:04 rsc.processor.DirectProcessorTest > onNextNull STARTED
12-Mar-2019 23:03:04
12-Mar-2019 23:03:04 rsc.processor.DirectProcessorTest > error STARTED
12-Mar-2019 23:03:04
12-Mar-2019 23:03:04 rsc.processor.DirectProcessorTest > onErrorNull STARTED
12-Mar-2019 23:03:04
12-Mar-2019 23:03:04 rsc.processor.DirectProcessorTest > terminatedWithError STARTED
12-Mar-2019 23:03:04
12-Mar-2019 23:03:04 rsc.processor.DirectProcessorTest > subscribeNull STARTED
12-Mar-2019 23:03:04
12-Mar-2019 23:03:04 rsc.processor.DirectProcessorTest > notEnoughRequests STARTED
12-Mar-2019 23:03:04
12-Mar-2019 23:03:04 rsc.parallel.ParallelPublisherTest > concatMapUnordered STARTED
12-Mar-2019 23:03:04
12-Mar-2019 23:03:04 rsc.parallel.ParallelPublisherTest > sequentialMode STARTED
12-Mar-2019 23:03:08
12-Mar-2019 23:03:08 rsc.parallel.ParallelPublisherTest > collectAsync2 STARTED
12-Mar-2019 23:03:08
12-Mar-2019 23:03:08 rsc.parallel.ParallelPublisherTest > collectAsync3 STARTED
12-Mar-2019 23:03:08
12-Mar-2019 23:03:08 rsc.parallel.ParallelPublisherTest > parallelMode STARTED
12-Mar-2019 23:03:26
12-Mar-2019 23:03:26 rsc.parallel.ParallelPublisherTest > flatMapUnordered STARTED
12-Mar-2019 23:03:26
12-Mar-2019 23:03:26 rsc.parallel.ParallelPublisherTest > reduceFull STARTED
12-Mar-2019 23:03:26
12-Mar-2019 23:03:26 rsc.parallel.ParallelPublisherTest > sorted STARTED
12-Mar-2019 23:03:26
12-Mar-2019 23:03:26 rsc.parallel.ParallelPublisherTest > sequentialModeFused STARTED
12-Mar-2019 23:03:29
12-Mar-2019 23:03:29 rsc.parallel.ParallelPublisherTest > collectAsync3Take STARTED
12-Mar-2019 23:03:29
12-Mar-2019 23:03:29 rsc.parallel.ParallelPublisherTest > collectAsync4Take STARTED
12-Mar-2019 23:03:29
12-Mar-2019 23:03:29 rsc.parallel.ParallelPublisherTest > collectAsyncFused STARTED
12-Mar-2019 23:03:29
12-Mar-2019 23:03:29 rsc.parallel.ParallelPublisherTest > collectAsync3Fused STARTED
12-Mar-2019 23:03:29
12-Mar-2019 23:03:29 rsc.parallel.ParallelPublisherTest > parallelReduceFull STARTED
12-Mar-2019 23:03:29
12-Mar-2019 23:03:29 rsc.parallel.ParallelPublisherTest > from STARTED
12-Mar-2019 23:03:29
12-Mar-2019 23:03:29 rsc.parallel.ParallelPublisherTest > parallelModeFused STARTED
12-Mar-2019 23:03:45
12-Mar-2019 23:03:45 rsc.parallel.ParallelPublisherTest > concatMapOrdered STARTED
12-Mar-2019 23:03:45
12-Mar-2019 23:03:45 rsc.parallel.ParallelPublisherTest > orderedSourceMapJoin STARTED
12-Mar-2019 23:03:45
12-Mar-2019 23:03:45 rsc.parallel.ParallelPublisherTest > emptySourceZeroRequest STARTED
12-Mar-2019 23:03:45
12-Mar-2019 23:03:45 rsc.parallel.ParallelPublisherTest > collect STARTED
12-Mar-2019 23:03:45
12-Mar-2019 23:03:45 rsc.parallel.ParallelPublisherTest > groupMerge STARTED
12-Mar-2019 23:03:45
12-Mar-2019 23:03:45 rsc.parallel.ParallelPublisherTest > streamCollect STARTED
12-Mar-2019 23:03:45
12-Mar-2019 23:03:45 rsc.parallel.ParallelPublisherTest > collectAsync STARTED
12-Mar-2019 23:03:45
12-Mar-2019 23:03:45 rsc.parallel.ParallelPublisherTest > orderedSourceFilterJoin STARTED
12-Mar-2019 23:03:45
12-Mar-2019 23:03:45 rsc.parallel.ParallelPublisherTest > toSortedList STARTED
12-Mar-2019 23:03:45
12-Mar-2019 23:03:45 rsc.util.SpscFreeListTrackerTest > addUntilGrows STARTED
12-Mar-2019 23:03:45
12-Mar-2019 23:03:45 rsc.util.ConstructorTestBuilderTest > compileWithParamNames STARTED
12-Mar-2019 23:03:45
12-Mar-2019 23:03:45 rsc.util.ConstructorTestBuilderTest > noRefNullCheck STARTED
12-Mar-2019 23:03:45
12-Mar-2019 23:03:45 rsc.util.ConstructorTestBuilderTest > noRangeCheck STARTED
12-Mar-2019 23:03:45
12-Mar-2019 23:03:45 rsc.util.SpscLinkedArrayQueueTest > offerTakeOneByOne STARTED
12-Mar-2019 23:03:45
12-Mar-2019 23:03:45 rsc.util.SpscLinkedArrayQueueTest > grow STARTED
12-Mar-2019 23:03:48 :jar
12-Mar-2019 23:03:49 /opt/bamboo-home/xml-data/build-dir/REACTOR-RSC-JOB1/src/main/java/rsc/subscriber/BasicConditionalSubscriber.java:45: warning: no description for @param
12-Mar-2019 23:03:49      * @param ex
12-Mar-2019 23:03:49        ^
12-Mar-2019 23:03:49 /opt/bamboo-home/xml-data/build-dir/REACTOR-RSC-JOB1/src/main/java/rsc/subscriber/BasicConditionalSubscriber.java:59: warning: no description for @param
12-Mar-2019 23:03:49      * @param ex
12-Mar-2019 23:03:49        ^
12-Mar-2019 23:03:49 /opt/bamboo-home/xml-data/build-dir/REACTOR-RSC-JOB1/src/main/java/rsc/subscriber/BasicSubscriber.java:43: warning: no description for @param
12-Mar-2019 23:03:49      * @param ex
12-Mar-2019 23:03:49        ^
12-Mar-2019 23:03:49 /opt/bamboo-home/xml-data/build-dir/REACTOR-RSC-JOB1/src/main/java/rsc/subscriber/BasicSubscriber.java:57: warning: no description for @param
12-Mar-2019 23:03:49      * @param ex
12-Mar-2019 23:03:49        ^
12-Mar-2019 23:03:49 /opt/bamboo-home/xml-data/build-dir/REACTOR-RSC-JOB1/src/main/java/rsc/subscriber/DeferredSubscription.java:70: warning: no description for @param
12-Mar-2019 23:03:49      * @param s
12-Mar-2019 23:03:49        ^
12-Mar-2019 23:03:49 /opt/bamboo-home/xml-data/build-dir/REACTOR-RSC-JOB1/src/main/java/rsc/subscriber/DeferredSubscriptionSubscriber.java:36: warning: no description for @param
12-Mar-2019 23:03:49      * @param initialRequest
12-Mar-2019 23:03:49        ^
12-Mar-2019 23:03:49 /opt/bamboo-home/xml-data/build-dir/REACTOR-RSC-JOB1/src/main/java/rsc/subscriber/SerializedSubscriber.java:46: warning: no description for @param
12-Mar-2019 23:03:49      * @param <T>
12-Mar-2019 23:03:49        ^
12-Mar-2019 23:03:49 /opt/bamboo-home/xml-data/build-dir/REACTOR-RSC-JOB1/src/main/java/rsc/subscriber/SerializedSubscriber.java:12: warning: empty <p> tag
12-Mar-2019 23:03:49 * <p>
12-Mar-2019 23:03:49    ^
12-Mar-2019 23:03:49 /opt/bamboo-home/xml-data/build-dir/REACTOR-RSC-JOB1/src/main/java/rsc/subscriber/SerializedSubscriber.java:15: warning: empty <p> tag
12-Mar-2019 23:03:49 * <p>
12-Mar-2019 23:03:49    ^
12-Mar-2019 23:03:49 /opt/bamboo-home/xml-data/build-dir/REACTOR-RSC-JOB1/src/main/java/rsc/subscriber/SubscriptionHelper.java:22: warning: no description for @param
12-Mar-2019 23:03:49      * @param s
12-Mar-2019 23:03:49        ^
12-Mar-2019 23:03:49 /opt/bamboo-home/xml-data/build-dir/REACTOR-RSC-JOB1/src/main/java/rsc/subscriber/SubscriptionHelper.java:58: warning: no description for @param
12-Mar-2019 23:03:49      * @param s
12-Mar-2019 23:03:49        ^
12-Mar-2019 23:03:49 /opt/bamboo-home/xml-data/build-dir/REACTOR-RSC-JOB1/src/main/java/rsc/subscriber/SubscriptionHelper.java:59: warning: no description for @param
12-Mar-2019 23:03:49      * @param e
12-Mar-2019 23:03:49        ^
12-Mar-2019 23:03:49 /opt/bamboo-home/xml-data/build-dir/REACTOR-RSC-JOB1/src/main/java/rsc/scheduler/ConsumerFactoryScheduler.java:11: error: bad use of '>'
12-Mar-2019 23:03:49 * Wraps the old Callable&lt;Consumer&lt;Runnable>> based API into a scheduler.
12-Mar-2019 23:03:49                                                  ^
12-Mar-2019 23:03:49 /opt/bamboo-home/xml-data/build-dir/REACTOR-RSC-JOB1/src/main/java/rsc/scheduler/ConsumerFactoryScheduler.java:11: error: bad use of '>'
12-Mar-2019 23:03:49 * Wraps the old Callable&lt;Consumer&lt;Runnable>> based API into a scheduler.
12-Mar-2019 23:03:49                                                   ^
12-Mar-2019 23:03:49 /opt/bamboo-home/xml-data/build-dir/REACTOR-RSC-JOB1/src/main/java/rsc/test/TestSubscriber.java:17: warning: empty <p> tag
12-Mar-2019 23:03:49 * <p>
12-Mar-2019 23:03:49    ^
12-Mar-2019 23:03:49 /opt/bamboo-home/xml-data/build-dir/REACTOR-RSC-JOB1/src/main/java/rsc/processor/DirectProcessor.java:24: warning: empty <p> tag
12-Mar-2019 23:03:49 * <p>
12-Mar-2019 23:03:49    ^
12-Mar-2019 23:03:49 /opt/bamboo-home/xml-data/build-dir/REACTOR-RSC-JOB1/src/main/java/rsc/processor/DirectProcessor.java:28: warning: empty <p> tag
12-Mar-2019 23:03:49 * <p>
12-Mar-2019 23:03:49    ^
12-Mar-2019 23:03:49 /opt/bamboo-home/xml-data/build-dir/REACTOR-RSC-JOB1/src/main/java/rsc/processor/DirectProcessor.java:31: warning: empty <p> tag
12-Mar-2019 23:03:49 * <p>
12-Mar-2019 23:03:49    ^
12-Mar-2019 23:03:50 /opt/bamboo-home/xml-data/build-dir/REACTOR-RSC-JOB1/src/main/java/rsc/publisher/BlockingFuture.java:22: warning: no description for @param
12-Mar-2019 23:03:50 * @param <T>
12-Mar-2019 23:03:50    ^
12-Mar-2019 23:03:50 /opt/bamboo-home/xml-data/build-dir/REACTOR-RSC-JOB1/src/main/java/rsc/publisher/ConnectablePublisherProcess.java:21: warning: no description for @param
12-Mar-2019 23:03:50 * @param <T>
12-Mar-2019 23:03:50    ^
12-Mar-2019 23:03:50 /opt/bamboo-home/xml-data/build-dir/REACTOR-RSC-JOB1/src/main/java/rsc/publisher/ConnectablePublisherProcess.java:22: warning: no description for @param
12-Mar-2019 23:03:50 * @param <U>
12-Mar-2019 23:03:50    ^
12-Mar-2019 23:03:50 /opt/bamboo-home/xml-data/build-dir/REACTOR-RSC-JOB1/src/main/java/rsc/publisher/PublisherGenerate.java:22: warning: empty <p> tag
12-Mar-2019 23:03:50 * <p>
12-Mar-2019 23:03:50    ^
12-Mar-2019 23:03:51 /opt/bamboo-home/xml-data/build-dir/REACTOR-RSC-JOB1/src/main/java/rsc/publisher/PublisherPeek.java:22: warning: empty <p> tag
12-Mar-2019 23:03:51 * <p>
12-Mar-2019 23:03:51    ^
12-Mar-2019 23:03:51 /opt/bamboo-home/xml-data/build-dir/REACTOR-RSC-JOB1/src/main/java/rsc/publisher/PublisherPeek.java:25: warning: empty <p> tag
12-Mar-2019 23:03:51 * <p>
12-Mar-2019 23:03:51    ^
12-Mar-2019 23:03:51 /opt/bamboo-home/xml-data/build-dir/REACTOR-RSC-JOB1/src/main/java/rsc/publisher/PublisherPeekFuseable.java:19: warning: empty <p> tag
12-Mar-2019 23:03:51 * <p>
12-Mar-2019 23:03:51    ^
12-Mar-2019 23:03:51 /opt/bamboo-home/xml-data/build-dir/REACTOR-RSC-JOB1/src/main/java/rsc/publisher/PublisherPeekFuseable.java:22: warning: empty <p> tag
12-Mar-2019 23:03:51 * <p>
12-Mar-2019 23:03:51    ^
12-Mar-2019 23:03:51 /opt/bamboo-home/xml-data/build-dir/REACTOR-RSC-JOB1/src/main/java/rsc/publisher/PublisherRepeatWhen.java:22: warning: empty <p> tag
12-Mar-2019 23:03:51 * <p>
12-Mar-2019 23:03:51    ^
12-Mar-2019 23:03:51 /opt/bamboo-home/xml-data/build-dir/REACTOR-RSC-JOB1/src/main/java/rsc/publisher/PublisherRetryWhen.java:22: warning: empty <p> tag
12-Mar-2019 23:03:51 * <p>
12-Mar-2019 23:03:51    ^
12-Mar-2019 23:03:51 /opt/bamboo-home/xml-data/build-dir/REACTOR-RSC-JOB1/src/main/java/rsc/publisher/PublisherSample.java:17: warning: empty <p> tag
12-Mar-2019 23:03:51 * <p>
12-Mar-2019 23:03:51    ^
12-Mar-2019 23:03:51 /opt/bamboo-home/xml-data/build-dir/REACTOR-RSC-JOB1/src/main/java/rsc/publisher/PublisherSample.java:21: warning: empty <p> tag
12-Mar-2019 23:03:51 * <p>
12-Mar-2019 23:03:51    ^
12-Mar-2019 23:03:51 /opt/bamboo-home/xml-data/build-dir/REACTOR-RSC-JOB1/src/main/java/rsc/publisher/PublisherSingle.java:45: warning: no description for @param
12-Mar-2019 23:03:51      * @param <T>
12-Mar-2019 23:03:51        ^
12-Mar-2019 23:03:51 /opt/bamboo-home/xml-data/build-dir/REACTOR-RSC-JOB1/src/main/java/rsc/publisher/PublisherSubscribeOnValue.java:17: warning: no description for @param
12-Mar-2019 23:03:51 * @param <T>
12-Mar-2019 23:03:51    ^
12-Mar-2019 23:03:52 /opt/bamboo-home/xml-data/build-dir/REACTOR-RSC-JOB1/src/main/java/rsc/publisher/PublisherUsing.java:22: warning: empty <p> tag
12-Mar-2019 23:03:52 * <p>
12-Mar-2019 23:03:52    ^
12-Mar-2019 23:03:52 /opt/bamboo-home/xml-data/build-dir/REACTOR-RSC-JOB1/src/main/java/rsc/publisher/PublisherWithLatestFrom.java:18: warning: empty <p> tag
12-Mar-2019 23:03:52 * <p>
12-Mar-2019 23:03:52    ^
12-Mar-2019 23:03:52 /opt/bamboo-home/xml-data/build-dir/REACTOR-RSC-JOB1/src/main/java/rsc/publisher/SynchronousSink.java:51: warning: no description for @throws
12-Mar-2019 23:03:52      * @throws RuntimeException
12-Mar-2019 23:03:52        ^
12-Mar-2019 23:03:52 /opt/bamboo-home/xml-data/build-dir/REACTOR-RSC-JOB1/src/main/java/rsc/parallel/OrderedItem.java:17: warning: no description for @param
12-Mar-2019 23:03:52      * @param newValue
12-Mar-2019 23:03:52        ^
12-Mar-2019 23:03:52 /opt/bamboo-home/xml-data/build-dir/REACTOR-RSC-JOB1/src/main/java/rsc/util/BackpressureHelper.java:30: error: bad use of '>'
12-Mar-2019 23:03:52      * @param n the value to add, n > 0, not validated
12-Mar-2019 23:03:52                                     ^
12-Mar-2019 23:03:52 /opt/bamboo-home/xml-data/build-dir/REACTOR-RSC-JOB1/src/main/java/rsc/util/DrainHelper.java:20: warning: no description for @param
12-Mar-2019 23:03:52      * @param n
12-Mar-2019 23:03:52        ^
12-Mar-2019 23:03:52 /opt/bamboo-home/xml-data/build-dir/REACTOR-RSC-JOB1/src/main/java/rsc/util/DrainHelper.java:21: warning: no description for @param
12-Mar-2019 23:03:52      * @param actual
12-Mar-2019 23:03:52        ^
12-Mar-2019 23:03:52 /opt/bamboo-home/xml-data/build-dir/REACTOR-RSC-JOB1/src/main/java/rsc/util/DrainHelper.java:22: warning: no description for @param
12-Mar-2019 23:03:52      * @param queue
12-Mar-2019 23:03:52        ^
12-Mar-2019 23:03:52 /opt/bamboo-home/xml-data/build-dir/REACTOR-RSC-JOB1/src/main/java/rsc/util/DrainHelper.java:23: warning: no description for @param
12-Mar-2019 23:03:52      * @param state
12-Mar-2019 23:03:52        ^
12-Mar-2019 23:03:52 /opt/bamboo-home/xml-data/build-dir/REACTOR-RSC-JOB1/src/main/java/rsc/util/DrainHelper.java:24: warning: no description for @param
12-Mar-2019 23:03:52      * @param isCancelled
12-Mar-2019 23:03:52        ^
12-Mar-2019 23:03:52 /opt/bamboo-home/xml-data/build-dir/REACTOR-RSC-JOB1/src/main/java/rsc/util/DrainHelper.java:141: warning: no description for @param
12-Mar-2019 23:03:52      * @param actual
12-Mar-2019 23:03:52        ^
12-Mar-2019 23:03:52 /opt/bamboo-home/xml-data/build-dir/REACTOR-RSC-JOB1/src/main/java/rsc/util/DrainHelper.java:142: warning: no description for @param
12-Mar-2019 23:03:52      * @param queue
12-Mar-2019 23:03:52        ^
12-Mar-2019 23:03:52 /opt/bamboo-home/xml-data/build-dir/REACTOR-RSC-JOB1/src/main/java/rsc/util/DrainHelper.java:143: warning: no description for @param
12-Mar-2019 23:03:52      * @param state
12-Mar-2019 23:03:52        ^
12-Mar-2019 23:03:52 /opt/bamboo-home/xml-data/build-dir/REACTOR-RSC-JOB1/src/main/java/rsc/util/DrainHelper.java:144: warning: no description for @param
12-Mar-2019 23:03:52      * @param isCancelled
12-Mar-2019 23:03:52        ^
12-Mar-2019 23:03:52 /opt/bamboo-home/xml-data/build-dir/REACTOR-RSC-JOB1/src/main/java/rsc/util/DrainHelper.java:186: warning: no description for @param
12-Mar-2019 23:03:52      * @param n
12-Mar-2019 23:03:52        ^
12-Mar-2019 23:03:52 /opt/bamboo-home/xml-data/build-dir/REACTOR-RSC-JOB1/src/main/java/rsc/util/DrainHelper.java:187: warning: no description for @param
12-Mar-2019 23:03:52      * @param actual
12-Mar-2019 23:03:52        ^
12-Mar-2019 23:03:52 /opt/bamboo-home/xml-data/build-dir/REACTOR-RSC-JOB1/src/main/java/rsc/util/DrainHelper.java:188: warning: no description for @param
12-Mar-2019 23:03:52      * @param queue
12-Mar-2019 23:03:52        ^
12-Mar-2019 23:03:52 /opt/bamboo-home/xml-data/build-dir/REACTOR-RSC-JOB1/src/main/java/rsc/util/DrainHelper.java:189: warning: no description for @param
12-Mar-2019 23:03:52      * @param field
12-Mar-2019 23:03:52        ^
12-Mar-2019 23:03:52 /opt/bamboo-home/xml-data/build-dir/REACTOR-RSC-JOB1/src/main/java/rsc/util/DrainHelper.java:190: warning: no description for @param
12-Mar-2019 23:03:52      * @param instance
12-Mar-2019 23:03:52        ^
12-Mar-2019 23:03:52 /opt/bamboo-home/xml-data/build-dir/REACTOR-RSC-JOB1/src/main/java/rsc/util/DrainHelper.java:191: warning: no description for @param
12-Mar-2019 23:03:52      * @param isCancelled
12-Mar-2019 23:03:52        ^
12-Mar-2019 23:03:52 /opt/bamboo-home/xml-data/build-dir/REACTOR-RSC-JOB1/src/main/java/rsc/util/DrainHelper.java:311: warning: no description for @param
12-Mar-2019 23:03:52      * @param actual
12-Mar-2019 23:03:52        ^
12-Mar-2019 23:03:52 /opt/bamboo-home/xml-data/build-dir/REACTOR-RSC-JOB1/src/main/java/rsc/util/DrainHelper.java:312: warning: no description for @param
12-Mar-2019 23:03:52      * @param queue
12-Mar-2019 23:03:52        ^
12-Mar-2019 23:03:52 /opt/bamboo-home/xml-data/build-dir/REACTOR-RSC-JOB1/src/main/java/rsc/util/DrainHelper.java:313: warning: no description for @param
12-Mar-2019 23:03:52      * @param field
12-Mar-2019 23:03:52        ^
12-Mar-2019 23:03:52 /opt/bamboo-home/xml-data/build-dir/REACTOR-RSC-JOB1/src/main/java/rsc/util/DrainHelper.java:314: warning: no description for @param
12-Mar-2019 23:03:52      * @param instance
12-Mar-2019 23:03:52        ^
12-Mar-2019 23:03:52 /opt/bamboo-home/xml-data/build-dir/REACTOR-RSC-JOB1/src/main/java/rsc/util/DrainHelper.java:315: warning: no description for @param
12-Mar-2019 23:03:52      * @param isCancelled
12-Mar-2019 23:03:52        ^
12-Mar-2019 23:03:52 /opt/bamboo-home/xml-data/build-dir/REACTOR-RSC-JOB1/src/main/java/rsc/util/ExceptionHelper.java:60: warning: no description for @param
12-Mar-2019 23:03:52      * @param t
12-Mar-2019 23:03:52        ^
12-Mar-2019 23:03:52 :javadoc
12-Mar-2019 23:03:52 3 errors
12-Mar-2019 23:03:52 55 warnings
12-Mar-2019 23:03:52 :javadocJar
12-Mar-2019 23:03:52 :sourcesJar
12-Mar-2019 23:03:52 :assemble
12-Mar-2019 23:03:53 :install
12-Mar-2019 23:03:53 :uploadArchives
12-Mar-2019 23:03:53 :artifactoryPublish
12-Mar-2019 23:03:53 :artifactoryDeploy
12-Mar-2019 23:03:53 Deploying artifact: https://repo.spring.io/libs-snapshot-local/io/projectreactor/reactive-streams-commons/0.6.0.BUILD-SNAPSHOT/reactive-streams-commons-0.6.0.BUILD-SNAPSHOT-javadoc.jar
12-Mar-2019 23:06:10 :artifactoryDeploy FAILED
12-Mar-2019 23:06:10
12-Mar-2019 23:06:10 FAILURE: Build failed with an exception.
12-Mar-2019 23:06:10
12-Mar-2019 23:06:10 * What went wrong:
12-Mar-2019 23:06:10 Execution failed for task ':artifactoryDeploy'.
12-Mar-2019 23:06:10 > java.io.IOException: Failed to deploy file. Status code: 401 Response message: Artifactory returned the following errors:
12-Mar-2019 23:06:10   Unauthorized Status code: 401
12-Mar-2019 23:06:10
12-Mar-2019 23:06:10 * Try:
12-Mar-2019 23:06:10
12-Mar-2019 23:06:10 BUILD FAILED
12-Mar-2019 23:06:10
12-Mar-2019 23:06:10 Run with --stacktrace option to get the stack trace. Run with --info or --debug option to get more log output.
12-Mar-2019 23:06:10 Total time: 8 mins 5.182 secs
12-Mar-2019 23:06:10
12-Mar-2019 23:06:10 Failing task since return code of [./gradlew clean test assemble -I /tmp/artifactory.init.script8922410235335501961gradle -DbuildInfoConfig.propertiesFile=/tmp/buildinfo8588284399618174032properties artifactoryPublish -Dartifactory.resolve.password=******** -Dartifactory.publish.password=********] was 1 while expected 0
12-Mar-2019 23:06:10 Parsing test results under /opt/bamboo-home/xml-data/build-dir/REACTOR-RSC-JOB1...
12-Mar-2019 23:06:10 Finished task 'Artifactory Gradle' with result: Failed
12-Mar-2019 23:06:10 Running post build plugin 'Docker Container Cleanup'
12-Mar-2019 23:06:10 Running post build plugin 'NCover Results Collector'
12-Mar-2019 23:06:10 Running post build plugin 'Artifactory Release Management Staging'
12-Mar-2019 23:06:10 Running post build plugin 'Artifactory Build Info Copier'
12-Mar-2019 23:06:10 Running post build plugin 'Artifactory Gradle Properties Info Copier'
12-Mar-2019 23:06:10 Running post build plugin 'Clover Results Collector'
12-Mar-2019 23:06:10 Running post build plugin 'npm Cache Cleanup'
12-Mar-2019 23:06:10 Running post build plugin 'Artifact Copier'
12-Mar-2019 23:06:10 Finalising the build...
12-Mar-2019 23:06:10 Stopping timer.
12-Mar-2019 23:06:10 Build REACTOR-RSC-JOB1-610 completed.
12-Mar-2019 23:06:10 Running on server: post build plugin 'NCover Results Collector'
12-Mar-2019 23:06:10 Running on server: post build plugin 'Build Hanging Detection Configuration'
12-Mar-2019 23:06:10 Running on server: post build plugin 'Clover Delta Calculator'
12-Mar-2019 23:06:10 Running on server: post build plugin 'Maven Dependencies Postprocessor'
12-Mar-2019 23:06:10 All post build plugins have finished
12-Mar-2019 23:06:10 Generating build results summary...
12-Mar-2019 23:06:10 Saving build results to disk...
12-Mar-2019 23:06:10 Logging substituted variables...
12-Mar-2019 23:06:10 Indexing build results...
12-Mar-2019 23:06:10 Finished building REACTOR-RSC-JOB1-610.