Build: #611 failed

Job: Default Job failed

Stages & jobs

  1. Default Stage

Job result summary

Completed
Duration
5 minutes
Revision
c836d26a624de74fb33feab4c32705a039d14186 c836d26a624de74fb33feab4c32705a039d14186
Total tests
1055
Failing since
#610 (Manual run by Stephane Maldini)
Fixed in
#612 (Manual run by Stephane Maldini)

Tests

  • 1,055 tests in total
  • 1 test failed
  • 1 failure is new
  • 1 test was quarantined / skipped
  • 5 minutes taken in total.
New test failures 1
Status Test Duration
Collapse Failed PublisherObserveOnTest crossRangeMaxHiddenLoop History
45 secs
java.lang.AssertionError: java.lang.AssertionError: (active) TestSubscriber timed out. Received: 1999938, last event: 9249 ms ago; values = 1999938
java.lang.AssertionError: (active) TestSubscriber timed out. Received: 1999938, last event: 9249 ms ago; values = 1999938
	at rsc.test.TestSubscriber.assertionError(TestSubscriber.java:209)
	at rsc.test.TestSubscriber.assertTerminated(TestSubscriber.java:712)
	at rsc.publisher.PublisherObserveOnTest.crossRangeMaxHidden(PublisherObserveOnTest.java:714)
	at rsc.publisher.PublisherObserveOnTest.crossRangeMaxHiddenLoop(PublisherObserveOnTest.java:699)
	at sun.reflect.NativeMethodAccessorImpl.invoke0(Native Method)
	at sun.reflect.NativeMethodAccessorImpl.invoke(NativeMethodAccessorImpl.java:62)
(41 more lines...)

Error summary

The build generated some errors. See the full build log for more details.

Note: /opt/bamboo-home/xml-data/build-dir/REACTOR-RSC-JOB1/src/main/java/rsc/publisher/Px.java uses unchecked or unsafe operations.
Note: Recompile with -Xlint:unchecked for details.
Note: /opt/bamboo-home/xml-data/build-dir/REACTOR-RSC-JOB1/src/test/java/rsc/publisher/PublisherAmbTest.java uses unchecked or unsafe operations.
Note: Recompile with -Xlint:unchecked for details.

1055 tests completed, 1 failed, 1 skipped

FAILURE: Build failed with an exception.

* What went wrong:
Execution failed for task ':test'.
> There were failing tests. See the report at: file:///opt/bamboo-home/xml-data/build-dir/REACTOR-RSC-JOB1/build/reports/tests/index.html

* Try:
Run with --stacktrace option to get the stack trace. Run with --info or --debug option to get more log output.