Activity build for the REST client

Build: #286 failed Manual run by Arnaud Cogoluègnes

Build result summary

Details

Completed
Duration
37 seconds
Labels
None
Agent
bamboo-22.af.pivotal.io
Revision
d6fb60d88f00546ce5d0e8b5a27b1978a17dd2b8 d6fb60d88f00546ce5d0e8b5a27b1978a17dd2b8
Failing since
#279 (Changes by Sergey Nechkin <snechkin@gmail.com> and Arnaud Cogoluègnes)
Fixed in
#287 (Manual run by Arnaud Cogoluègnes)
No failed tests found, a possible compilation error occurred.

Responsible

Configuration changes

Plan configuration has changed since the last successful build. See the plan audit log for more details.

Error summary for Default Job

The job generated some errors, drill down into the full build log for more details.

Could not find test result reports in the /opt/bamboo-home/xml-data/build-dir/RMQ-HH-JOB1 directory.
/opt/bamboo-home/xml-data/build-dir/RMQ-HH-JOB1/src/main/java/com/rabbitmq/http/client/domain/AckMode.java:48: error: unexpected text
     * @see https://www.rabbitmq.com/confirms.html
       ^
/opt/bamboo-home/xml-data/build-dir/RMQ-HH-JOB1/src/main/java/com/rabbitmq/http/client/domain/AckMode.java:50: warning - Tag @see:illegal character: "58" in "https://www.rabbitmq.com/confirms.html"
/opt/bamboo-home/xml-data/build-dir/RMQ-HH-JOB1/src/main/java/com/rabbitmq/http/client/domain/AckMode.java:50: warning - Tag @see:illegal character: "47" in "https://www.rabbitmq.com/confirms.html"
/opt/bamboo-home/xml-data/build-dir/RMQ-HH-JOB1/src/main/java/com/rabbitmq/http/client/domain/AckMode.java:50: warning - Tag @see:illegal character: "47" in "https://www.rabbitmq.com/confirms.html"
/opt/bamboo-home/xml-data/build-dir/RMQ-HH-JOB1/src/main/java/com/rabbitmq/http/client/domain/AckMode.java:50: warning - Tag @see:illegal character: "47" in "https://www.rabbitmq.com/confirms.html"
/opt/bamboo-home/xml-data/build-dir/RMQ-HH-JOB1/src/main/java/com/rabbitmq/http/client/domain/AckMode.java:30: error: unexpected text
     * @see https://www.rabbitmq.com/confirms.html
       ^
/opt/bamboo-home/xml-data/build-dir/RMQ-HH-JOB1/src/main/java/com/rabbitmq/http/client/domain/AckMode.java:32: warning - Tag @see:illegal character: "58" in "https://www.rabbitmq.com/confirms.html"
/opt/bamboo-home/xml-data/build-dir/RMQ-HH-JOB1/src/main/java/com/rabbitmq/http/client/domain/AckMode.java:32: warning - Tag @see:illegal character: "47" in "https://www.rabbitmq.com/confirms.html"
/opt/bamboo-home/xml-data/build-dir/RMQ-HH-JOB1/src/main/java/com/rabbitmq/http/client/domain/AckMode.java:32: warning - Tag @see:illegal character: "47" in "https://www.rabbitmq.com/confirms.html"
/opt/bamboo-home/xml-data/build-dir/RMQ-HH-JOB1/src/main/java/com/rabbitmq/http/client/domain/AckMode.java:32: warning - Tag @see:illegal character: "47" in "https://www.rabbitmq.com/confirms.html"
/opt/bamboo-home/xml-data/build-dir/RMQ-HH-JOB1/src/main/java/com/rabbitmq/http/client/domain/AckMode.java:40: error: unexpected text
     * @see https://www.rabbitmq.com/confirms.html
       ^
/opt/bamboo-home/xml-data/build-dir/RMQ-HH-JOB1/src/main/java/com/rabbitmq/http/client/domain/AckMode.java:42: warning - Tag @see:illegal character: "58" in "https://www.rabbitmq.com/confirms.html"
/opt/bamboo-home/xml-data/build-dir/RMQ-HH-JOB1/src/main/java/com/rabbitmq/http/client/domain/AckMode.java:42: warning - Tag @see:illegal character: "47" in "https://www.rabbitmq.com/confirms.html"
/opt/bamboo-home/xml-data/build-dir/RMQ-HH-JOB1/src/main/java/com/rabbitmq/http/client/domain/AckMode.java:42: warning - Tag @see:illegal character: "47" in "https://www.rabbitmq.com/confirms.html"
/opt/bamboo-home/xml-data/build-dir/RMQ-HH-JOB1/src/main/java/com/rabbitmq/http/client/domain/AckMode.java:42: warning - Tag @see:illegal character: "47" in "https://www.rabbitmq.com/confirms.html"
/opt/bamboo-home/xml-data/build-dir/RMQ-HH-JOB1/src/main/java/com/rabbitmq/http/client/Client.java:911: warning: no @return
  public List<UpstreamInfo> getUpstreams() {
                            ^
/opt/bamboo-home/xml-data/build-dir/RMQ-HH-JOB1/src/main/java/com/rabbitmq/http/client/Client.java:919: warning: no @return
  public List<UpstreamInfo> getUpstreams(String vhost) {
                            ^
/opt/bamboo-home/xml-data/build-dir/RMQ-HH-JOB1/src/main/java/com/rabbitmq/http/client/Client.java:958: warning: no @return
  public List<UpstreamSetInfo> getUpstreamSets() {
                               ^
/opt/bamboo-home/xml-data/build-dir/RMQ-HH-JOB1/src/main/java/com/rabbitmq/http/client/Client.java:966: warning: no @return
  public List<UpstreamSetInfo> getUpstreamSets(String vhost) {
                               ^
/opt/bamboo-home/xml-data/build-dir/RMQ-HH-JOB1/src/main/java/com/rabbitmq/http/client/HttpClientBuilderConfigurator.java:51: warning: no description for @param
     * @param builder
       ^
/opt/bamboo-home/xml-data/build-dir/RMQ-HH-JOB1/src/main/java/com/rabbitmq/http/client/ReactorNettyClient.java:553: warning: no @return
    public Mono<HttpResponse> declareUpstream(String vhost, String name, UpstreamDetails details) {
                              ^
/opt/bamboo-home/xml-data/build-dir/RMQ-HH-JOB1/src/main/java/com/rabbitmq/http/client/ReactorNettyClient.java:569: warning: no @return
    public Mono<HttpResponse> deleteUpstream(String vhost, String name) {
                              ^
/opt/bamboo-home/xml-data/build-dir/RMQ-HH-JOB1/src/main/java/com/rabbitmq/http/client/ReactorNettyClient.java:576: warning: no @return
    public Flux<UpstreamInfo> getUpstreams() {
                              ^
/opt/bamboo-home/xml-data/build-dir/RMQ-HH-JOB1/src/main/java/com/rabbitmq/http/client/ReactorNettyClient.java:584: warning: no @return
    public Flux<UpstreamInfo> getUpstreams(String vhost) {
                              ^
/opt/bamboo-home/xml-data/build-dir/RMQ-HH-JOB1/src/main/java/com/rabbitmq/http/client/ReactorNettyClient.java:595: warning: no @return
    public Mono<HttpResponse> declareUpstreamSet(String vhost, String name, List<UpstreamSetDetails> details) {
                              ^
/opt/bamboo-home/xml-data/build-dir/RMQ-HH-JOB1/src/main/java/com/rabbitmq/http/client/ReactorNettyClient.java:614: warning: no @return
    public Mono<HttpResponse> deleteUpstreamSet(String vhost, String name) {
                              ^
/opt/bamboo-home/xml-data/build-dir/RMQ-HH-JOB1/src/main/java/com/rabbitmq/http/client/ReactorNettyClient.java:621: warning: no @return
    public Flux<UpstreamSetInfo> getUpstreamSets() {
                                 ^
/opt/bamboo-home/xml-data/build-dir/RMQ-HH-JOB1/src/main/java/com/rabbitmq/http/client/ReactorNettyClient.java:630: warning: no @return
    public Flux<UpstreamSetInfo> getUpstreamSets(String vhost) {
                                 ^

FAILURE: Build failed with an exception.

* What went wrong:
Execution failed for task ':javadoc'.
> Javadoc generation failed. Generated Javadoc options file (useful for troubleshooting): '/opt/bamboo-home/xml-data/build-dir/RMQ-HH-JOB1/build/tmp/javadoc/javadoc.options'

* Try:
Run with --stacktrace option to get the stack trace. Run with --info or --debug option to get more log output. Run with --scan to get full insights.

* Get more help at https://help.gradle.org

BUILD FAILED in 21s