Spring Roo CI - Build

Build: #1517 failed Scheduled

Logs

The following logs have been generated by the jobs in this plan.
  • Expand all
  • Collapse all
Job Logs
Collapse Build Job Default Stage Download or View
13-Jan-2019 12:00:09 [INFO] Scanning for projects...
13-Jan-2019 12:00:10 [INFO] Downloading: http://maven.springframework.org/release/org/springframework/build/aws/org.springframework.build.aws.maven/3.1.0.RELEASE/org.springframework.build.aws.maven-3.1.0.RELEASE.pom
13-Jan-2019 12:00:11 [INFO] Downloaded: http://maven.springframework.org/release/org/springframework/build/aws/org.springframework.build.aws.maven/3.1.0.RELEASE/org.springframework.build.aws.maven-3.1.0.RELEASE.pom (4 KB at 12.2 KB/sec)
13-Jan-2019 12:00:11 [INFO] Downloading: http://maven.springframework.org/release/net/java/dev/jets3t/jets3t/0.8.0/jets3t-0.8.0.pom
13-Jan-2019 12:00:11 [INFO] Downloading: https://repo.maven.apache.org/maven2/net/java/dev/jets3t/jets3t/0.8.0/jets3t-0.8.0.pom
13-Jan-2019 12:00:11 [ERROR] [ERROR] Some problems were encountered while processing the POMs:
13-Jan-2019 12:00:11 [WARNING] 'build.plugins.plugin.version' for org.apache.maven.plugins:maven-source-plugin is missing. @ line 1004, column 21
13-Jan-2019 12:00:11 [ERROR] Unresolveable build extension: Plugin org.springframework.build.aws:org.springframework.build.aws.maven:3.1.0.RELEASE or one of its dependencies could not be resolved: Failed to collect dependencies at org.springframework.build.aws:org.springframework.build.aws.maven:jar:3.1.0.RELEASE -> net.java.dev.jets3t:jets3t:jar:0.8.0 @
13-Jan-2019 12:00:11 @
13-Jan-2019 12:00:11 [ERROR] The build could not read 1 project -> [Help 1]
13-Jan-2019 12:00:11 [ERROR]   
13-Jan-2019 12:00:11 [ERROR]   The project org.springframework.roo:org.springframework.roo.root:2.0.0.RELEASE (/opt/bamboo-home/xml-data/build-dir/ROO-BUILD-JOB1/pom.xml) has 1 error
13-Jan-2019 12:00:11 [ERROR]     Unresolveable build extension: Plugin org.springframework.build.aws:org.springframework.build.aws.maven:3.1.0.RELEASE or one of its dependencies could not be resolved: Failed to collect dependencies at org.springframework.build.aws:org.springframework.build.aws.maven:jar:3.1.0.RELEASE -> net.java.dev.jets3t:jets3t:jar:0.8.0: Failed to read artifact descriptor for net.java.dev.jets3t:jets3t:jar:0.8.0: Could not transfer artifact net.java.dev.jets3t:jets3t:pom:0.8.0 from/to central (https://repo.maven.apache.org/maven2): Received fatal alert: protocol_version -> [Help 2]
13-Jan-2019 12:00:11 [ERROR]
13-Jan-2019 12:00:11 [ERROR] To see the full stack trace of the errors, re-run Maven with the -e switch.
13-Jan-2019 12:00:11 [ERROR] Re-run Maven using the -X switch to enable full debug logging.
13-Jan-2019 12:00:11 [ERROR]
13-Jan-2019 12:00:11 [ERROR] For more information about the errors and possible solutions, please read the following articles:
13-Jan-2019 12:00:11 [ERROR] [Help 1] http://cwiki.apache.org/confluence/display/MAVEN/ProjectBuildingException
13-Jan-2019 12:00:11 [ERROR] [Help 2] http://cwiki.apache.org/confluence/display/MAVEN/PluginManagerException