Spring Roo CI - Build

Build: #1518 failed Scheduled

Logs

The following logs have been generated by the jobs in this plan.
  • Expand all
  • Collapse all
Job Logs
Collapse Build Job Default Stage Download or View
14-Jan-2019 12:00:11 [INFO] Scanning for projects...
14-Jan-2019 12:00:12 [INFO] Downloading: http://maven.springframework.org/release/org/sonatype/plugins/nexus-staging-maven-plugin/1.6.3/nexus-staging-maven-plugin-1.6.3.pom
14-Jan-2019 12:00:13 [INFO] Downloading: https://repo.maven.apache.org/maven2/org/sonatype/plugins/nexus-staging-maven-plugin/1.6.3/nexus-staging-maven-plugin-1.6.3.pom
14-Jan-2019 12:00:13 [ERROR] [ERROR] Some problems were encountered while processing the POMs:
14-Jan-2019 12:00:13 [WARNING] 'build.plugins.plugin.version' for org.apache.maven.plugins:maven-source-plugin is missing. @ line 1004, column 21
14-Jan-2019 12:00:13 [ERROR] Unresolveable build extension: Plugin org.sonatype.plugins:nexus-staging-maven-plugin:1.6.3 or one of its dependencies could not be resolved: Failed to read artifact descriptor for org.sonatype.plugins:nexus-staging-maven-plugin:jar:1.6.3 @
14-Jan-2019 12:00:13 @
14-Jan-2019 12:00:13 [ERROR] The build could not read 1 project -> [Help 1]
14-Jan-2019 12:00:13 [ERROR]   
14-Jan-2019 12:00:13 [ERROR]   The project org.springframework.roo:org.springframework.roo.root:2.0.0.RELEASE (/opt/bamboo-home/xml-data/build-dir/ROO-BUILD-JOB1/pom.xml) has 1 error
14-Jan-2019 12:00:13 [ERROR]     Unresolveable build extension: Plugin org.sonatype.plugins:nexus-staging-maven-plugin:1.6.3 or one of its dependencies could not be resolved: Failed to read artifact descriptor for org.sonatype.plugins:nexus-staging-maven-plugin:jar:1.6.3: Could not transfer artifact org.sonatype.plugins:nexus-staging-maven-plugin:pom:1.6.3 from/to central (https://repo.maven.apache.org/maven2): Received fatal alert: protocol_version -> [Help 2]
14-Jan-2019 12:00:13 [ERROR]
14-Jan-2019 12:00:13 [ERROR] To see the full stack trace of the errors, re-run Maven with the -e switch.
14-Jan-2019 12:00:13 [ERROR] Re-run Maven using the -X switch to enable full debug logging.
14-Jan-2019 12:00:13 [ERROR]
14-Jan-2019 12:00:13 [ERROR] For more information about the errors and possible solutions, please read the following articles:
14-Jan-2019 12:00:13 [ERROR] [Help 1] http://cwiki.apache.org/confluence/display/MAVEN/ProjectBuildingException
14-Jan-2019 12:00:13 [ERROR] [Help 2] http://cwiki.apache.org/confluence/display/MAVEN/PluginManagerException