Build Spring Cloud Data Flow

Build: #2030 failed Changes by Christian Tzolov

Stages & jobs

  1. Default Stage

  2. Build Docker Images and upload

Build result summary

Details

Completed
Duration
8 minutes
Labels
None
Revision
955901bdeb6afe5367348bc76a28d27b42a0b3d2 955901bdeb6afe5367348bc76a28d27b42a0b3d2
Total tests
1201
Fixed in
#2032 (Changes by Christian Tzolov)

Tests

Responsible

Code commits

Author Commit Message Commit date
Christian Tzolov Christian Tzolov 955901bdeb6afe5367348bc76a28d27b42a0b3d2 955901bdeb6afe5367348bc76a28d27b42a0b3d2 Support comma chars in Task argument values
  Allow passing comma characters into Task's launch arguments list

Resolves #1826

Configuration changes

Some of the jobs or stages referenced by this result no longer exist.

Tests

New test failures 5
Status Test View job Duration
Collapse Failed TaskExecutionsDocumentation removeTaskExecution History
Build and install SCDF < 1 sec
java.lang.AssertionError: Status expected:<200> but was:<404>
	at org.springframework.test.util.AssertionErrors.fail(AssertionErrors.java:54)
	at org.springframework.test.util.AssertionErrors.assertEquals(AssertionErrors.java:81)
	at org.springframework.test.web.servlet.result.StatusResultMatchers$10.match(StatusResultMatchers.java:665)
	at org.springframework.test.web.servlet.MockMvc$1.andExpect(MockMvc.java:171)
	at org.springframework.cloud.dataflow.server.rest.documentation.TaskExecutionsDocumentation.removeTaskExecution(TaskExecutionsDocumentation.java:146)
	at sun.reflect.NativeMethodAccessorImpl.invoke0(Native Method)
	at sun.reflect.NativeMethodAccessorImpl.invoke(NativeMethodAccessorImpl.java:62)
(33 more lines...)
Collapse Failed TaskExecutionsDocumentation listTaskExecutionsByName History
Build and install SCDF < 1 sec
org.springframework.restdocs.snippet.SnippetException: Fields with the following paths were not found in the payload: [_embedded.taskExecutionResourceList]
	at org.springframework.restdocs.payload.AbstractFieldsSnippet.validateFieldDocumentation(AbstractFieldsSnippet.java:176)
	at org.springframework.restdocs.payload.AbstractFieldsSnippet.createModel(AbstractFieldsSnippet.java:100)
	at org.springframework.restdocs.snippet.TemplatedSnippet.document(TemplatedSnippet.java:64)
	at org.springframework.restdocs.generate.RestDocumentationGenerator.handle(RestDocumentationGenerator.java:196)
	at org.springframework.restdocs.mockmvc.RestDocumentationResultHandler$1.handle(RestDocumentationResultHandler.java:100)
	at org.springframework.test.web.servlet.MockMvc$1.andDo(MockMvc.java:177)
	at org.springframework.cloud.dataflow.server.rest.documentation.TaskExecutionsDocumentation.listTaskExecutionsByName(TaskExecutionsDocumentation.java:114)
(35 more lines...)
Collapse Failed TaskExecutionsDocumentation launchTaskDisplayDetail History
Build and install SCDF < 1 sec
java.lang.AssertionError: Status expected:<200> but was:<404>
	at org.springframework.test.util.AssertionErrors.fail(AssertionErrors.java:54)
	at org.springframework.test.util.AssertionErrors.assertEquals(AssertionErrors.java:81)
	at org.springframework.test.web.servlet.result.StatusResultMatchers$10.match(StatusResultMatchers.java:665)
	at org.springframework.test.web.servlet.MockMvc$1.andExpect(MockMvc.java:171)
	at org.springframework.cloud.dataflow.server.rest.documentation.TaskExecutionsDocumentation.launchTaskDisplayDetail(TaskExecutionsDocumentation.java:134)
	at sun.reflect.NativeMethodAccessorImpl.invoke0(Native Method)
	at sun.reflect.NativeMethodAccessorImpl.invoke(NativeMethodAccessorImpl.java:62)
(33 more lines...)
Collapse Failed TaskExecutionsDocumentation launchTask History
Build and install SCDF < 1 sec
java.lang.AssertionError: Status expected:<201> but was:<500>
	at org.springframework.test.util.AssertionErrors.fail(AssertionErrors.java:54)
	at org.springframework.test.util.AssertionErrors.assertEquals(AssertionErrors.java:81)
	at org.springframework.test.web.servlet.result.StatusResultMatchers$10.match(StatusResultMatchers.java:665)
	at org.springframework.test.web.servlet.MockMvc$1.andExpect(MockMvc.java:171)
	at org.springframework.cloud.dataflow.server.rest.documentation.TaskExecutionsDocumentation.launchTask(TaskExecutionsDocumentation.java:69)
	at sun.reflect.NativeMethodAccessorImpl.invoke0(Native Method)
	at sun.reflect.NativeMethodAccessorImpl.invoke(NativeMethodAccessorImpl.java:62)
(33 more lines...)
Collapse Failed TaskExecutionsDocumentation listTaskExecutions History
Build and install SCDF < 1 sec
java.lang.AssertionError: Status expected:<201> but was:<500>
	at org.springframework.test.util.AssertionErrors.fail(AssertionErrors.java:54)
	at org.springframework.test.util.AssertionErrors.assertEquals(AssertionErrors.java:81)
	at org.springframework.test.web.servlet.result.StatusResultMatchers$10.match(StatusResultMatchers.java:665)
	at org.springframework.test.web.servlet.MockMvc$1.andExpect(MockMvc.java:171)
	at org.springframework.cloud.dataflow.server.rest.documentation.TaskExecutionsDocumentation.lambda$listTaskExecutions$0(TaskExecutionsDocumentation.java:86)
	at org.springframework.cloud.dataflow.server.rest.documentation.BaseDocumentation$ToggleableResultHandler.dontDocument(BaseDocumentation.java:158)
	at org.springframework.cloud.dataflow.server.rest.documentation.TaskExecutionsDocumentation.listTaskExecutions(TaskExecutionsDocumentation.java:81)
(35 more lines...)