Build Spring Cloud Data Flow

Build result summary

Details

Completed
Duration
32 seconds
Labels
None
Agent
(elastic) Elastic Agent on i-1a6eceab
Revision
df612ea0729df76392383fbef9afa4f82914572f df612ea0729df76392383fbef9afa4f82914572f
Total tests
106
Fixed in
#220 (Changes by Thomas Risberg)

Tests

Responsible

No one has taken responsibility for this failure

Code commits

Author Commit Message Commit date
Sabby Anandan <sabby.anandan@gmail.com> Sabby Anandan <sabby.anandan@gmail.com> df612ea0729df76392383fbef9afa4f82914572f df612ea0729df76392383fbef9afa4f82914572f Update overview section

Tests

New test failures 2
Status Test View job Duration
Collapse Failed StreamCompletionProviderTests testSinkWithAllOptionsSetCantGoFurther History
Build and install SCDF < 1 sec
java.lang.AssertionError: 
Expected: an empty collection
     but: <[CompletionProposal[http --port=1234 --use.ssl=true --use.]]>
java.lang.AssertionError: Expected: an empty collection     but: <[CompletionProposal[http --port=1234 --use.ssl=true --use.]]>	at org.hamcrest.MatcherAssert.assertThat(MatcherAssert.java:20)	at org.junit.Assert.assertThat(Assert.java:956)	at org.junit.Assert.assertThat(Assert.java:923)	at org.springframework.cloud.dataflow.completion.StreamCompletionProviderTests.testSinkWithAllOptionsSetCantGoFurther(StreamCompletionProviderTests.java:163)
Collapse Failed StreamCompletionProviderTests testClosedSetValuesShouldBeExclusive History
Build and install SCDF < 1 sec
java.lang.AssertionError: 
Expected: not (a collection containing a proposal whose text a string starting with "http --use.ssl=tr ")
     but: was <[CompletionProposal[http --use.ssl=true], CompletionProposal[http --use.ssl=tr --port=], CompletionProposal[http --use.ssl=tr --use.]]>
java.lang.AssertionError: Expected: not (a collection containing a proposal whose text a string starting with "http --use.ssl=tr ")     but: was <[CompletionProposal[http --use.ssl=true], CompletionProposal[http --use.ssl=tr --port=], CompletionProposal[http --use.ssl=tr --use.]]>	at org.hamcrest.MatcherAssert.assertThat(MatcherAssert.java:20)	at org.junit.Assert.assertThat(Assert.java:956)	at org.junit.Assert.assertThat(Assert.java:923)	at org.springframework.cloud.dataflow.completion.StreamCompletionProviderTests.testClosedSetValuesShouldBeExclusive(StreamCompletionProviderTests.java:239)