Build Spring Cloud Data Flow

Build: #2365 failed Manual run by Ilayaperumal Gopinathan

Stages & jobs

  1. Default Stage

  2. Build Docker Images and upload

Build result summary

Details

Completed
Duration
2 minutes
Labels
None
Revision
15909c85c8d00b0acca996e4565347dc75a0c39d 15909c85c8d00b0acca996e4565347dc75a0c39d
Total tests
613
Failing since
#2363 (Changes by Ilayaperumal Gopinathan)
Fixed in
#2366 (Manual run by Ilayaperumal Gopinathan)

Responsible

Code commits

Author Commit Message Commit date
Ilayaperumal Gopinathan Ilayaperumal Gopinathan 15909c85c8d00b0acca996e4565347dc75a0c39d 15909c85c8d00b0acca996e4565347dc75a0c39d Change test context refresh
  - to DirtiesContext.ClassMode.BEFORE_EACH_TEST_METHOD

Configuration changes

Some of the jobs or stages referenced by this result no longer exist.

Tests

New test failures 3
Status Test View job Duration
Collapse Failed TabOnTapCompletionProviderTests testStreamNameAfterColon History
Build and install SCDF < 1 sec
org.springframework.dao.InvalidDataAccessResourceUsageException: could not prepare statement; SQL [select streamdefi0_.DEFINITION_NAME as DEFINITI1_2_0_, streamdefi0_.DEFINITION as DEFINITI2_2_0_ from STREAM_DEFINITIONS streamdefi0_ where streamdefi0_.DEFINITION_NAME=?]; nested exception is org.hibernate.exception.SQLGrammarException: could not prepare statement
	at org.springframework.cloud.dataflow.server.completion.TabOnTapCompletionProviderTests.setup(TabOnTapCompletionProviderTests.java:82)
Caused by: org.hibernate.exception.SQLGrammarException: could not prepare statement
	at org.springframework.cloud.dataflow.server.completion.TabOnTapCompletionProviderTests.setup(TabOnTapCompletionProviderTests.java:82)
Caused by: org.h2.jdbc.JdbcSQLException: 
Table "STREAM_DEFINITIONS" not found; SQL statement:
select streamdefi0_.DEFINITION_NAME as DEFINITI1_2_0_, streamdefi0_.DEFINITION as DEFINITI2_2_0_ from STREAM_DEFINITIONS streamdefi0_ where streamdefi0_.DEFINITION_NAME=? [42102-197]
	at org.springframework.cloud.dataflow.server.completion.TabOnTapCompletionProviderTests.setup(TabOnTapCompletionProviderTests.java:82)
Collapse Failed TabOnTapCompletionProviderTests testAppNamesAfterStreamNameWithDotAfterStreamName History
Build and install SCDF < 1 sec
org.springframework.dao.InvalidDataAccessResourceUsageException: could not prepare statement; SQL [select streamdefi0_.DEFINITION_NAME as DEFINITI1_2_0_, streamdefi0_.DEFINITION as DEFINITI2_2_0_ from STREAM_DEFINITIONS streamdefi0_ where streamdefi0_.DEFINITION_NAME=?]; nested exception is org.hibernate.exception.SQLGrammarException: could not prepare statement
	at org.springframework.cloud.dataflow.server.completion.TabOnTapCompletionProviderTests.setup(TabOnTapCompletionProviderTests.java:82)
Caused by: org.hibernate.exception.SQLGrammarException: could not prepare statement
	at org.springframework.cloud.dataflow.server.completion.TabOnTapCompletionProviderTests.setup(TabOnTapCompletionProviderTests.java:82)
Caused by: org.h2.jdbc.JdbcSQLException: 
Table "STREAM_DEFINITIONS" not found; SQL statement:
select streamdefi0_.DEFINITION_NAME as DEFINITI1_2_0_, streamdefi0_.DEFINITION as DEFINITI2_2_0_ from STREAM_DEFINITIONS streamdefi0_ where streamdefi0_.DEFINITION_NAME=? [42102-197]
	at org.springframework.cloud.dataflow.server.completion.TabOnTapCompletionProviderTests.setup(TabOnTapCompletionProviderTests.java:82)
Collapse Failed TabOnTapCompletionProviderTests testAppNamesAfterStreamName History
Build and install SCDF < 1 sec
org.springframework.dao.InvalidDataAccessResourceUsageException: could not prepare statement; SQL [select streamdefi0_.DEFINITION_NAME as DEFINITI1_2_0_, streamdefi0_.DEFINITION as DEFINITI2_2_0_ from STREAM_DEFINITIONS streamdefi0_ where streamdefi0_.DEFINITION_NAME=?]; nested exception is org.hibernate.exception.SQLGrammarException: could not prepare statement
	at org.springframework.cloud.dataflow.server.completion.TabOnTapCompletionProviderTests.setup(TabOnTapCompletionProviderTests.java:82)
Caused by: org.hibernate.exception.SQLGrammarException: could not prepare statement
	at org.springframework.cloud.dataflow.server.completion.TabOnTapCompletionProviderTests.setup(TabOnTapCompletionProviderTests.java:82)
Caused by: org.h2.jdbc.JdbcSQLException: 
Table "STREAM_DEFINITIONS" not found; SQL statement:
select streamdefi0_.DEFINITION_NAME as DEFINITI1_2_0_, streamdefi0_.DEFINITION as DEFINITI2_2_0_ from STREAM_DEFINITIONS streamdefi0_ where streamdefi0_.DEFINITION_NAME=? [42102-197]
	at org.springframework.cloud.dataflow.server.completion.TabOnTapCompletionProviderTests.setup(TabOnTapCompletionProviderTests.java:82)
Fixed tests 1
Status Test Failing since View job Duration
Successful TaskControllerTests testDisplaySingleTaskNotFound History
Failing since build #2363 (Changes by Ilayaperumal Gopinathan) Build and install SCDF < 1 sec