Build Spring Cloud Data Flow

Build: #2610 failed Changes by Gunnar Hillert

Stages & jobs

  1. Default Stage

  2. Build Docker Images and upload

Logs

The following logs have been generated by the jobs in this plan.
  • Expand all
  • Collapse all
Job Logs
Collapse Build and install SCDF Default Stage Download or View
14-Feb-2019 12:45:54 [INFO] spring-cloud-dataflow-shell ........................ SKIPPED
14-Feb-2019 12:45:54 [INFO] Spring Cloud Data Flow Docs for Classic mode ....... SKIPPED
14-Feb-2019 12:45:54 [INFO] Spring Cloud Data Flow Docs ........................ SKIPPED
14-Feb-2019 12:45:54 [INFO] spring-cloud-dataflow-dependencies ................. SKIPPED
14-Feb-2019 12:45:54 [INFO] ------------------------------------------------------------------------
14-Feb-2019 12:45:54 [INFO] BUILD FAILURE
14-Feb-2019 12:45:54 [INFO] ------------------------------------------------------------------------
14-Feb-2019 12:45:54 [INFO] Total time: 06:28 min
14-Feb-2019 12:45:54 [INFO] Finished at: 2019-02-14T12:45:54Z
14-Feb-2019 12:45:54 [INFO] Final Memory: 155M/790M
14-Feb-2019 12:45:54 [INFO] ------------------------------------------------------------------------
14-Feb-2019 12:45:54 [ERROR] Failed to execute goal org.apache.maven.plugins:maven-surefire-plugin:2.22.0:test (default-test) on project spring-cloud-dataflow-shell-core: There are test failures.
14-Feb-2019 12:45:54 [ERROR]
14-Feb-2019 12:45:54 [ERROR] Please refer to /opt/bamboo-home/xml-data/build-dir/SCD-BMASTER-JOB1/spring-cloud-dataflow-shell-core/target/surefire-reports for the individual test results.
14-Feb-2019 12:45:54 [ERROR] Please refer to dump files (if any exist) [date]-jvmRun[N].dump, [date].dumpstream and [date]-jvmRun[N].dumpstream.
14-Feb-2019 12:45:54 [ERROR] -> [Help 1]
14-Feb-2019 12:45:54 [ERROR]
14-Feb-2019 12:45:54 [ERROR] To see the full stack trace of the errors, re-run Maven with the -e switch.
14-Feb-2019 12:45:54 [ERROR] Re-run Maven using the -X switch to enable full debug logging.
14-Feb-2019 12:45:54 [ERROR]
14-Feb-2019 12:45:54 [ERROR] For more information about the errors and possible solutions, please read the following articles:
14-Feb-2019 12:45:54 [ERROR] [Help 1] http://cwiki.apache.org/confluence/display/MAVEN/MojoFailureException
14-Feb-2019 12:45:54 [ERROR]
14-Feb-2019 12:45:54 [ERROR] After correcting the problems, you can resume the build with the command
14-Feb-2019 12:45:54 [ERROR]   mvn <goals> -rf :spring-cloud-dataflow-shell-core