Build Spring Cloud Data Flow

Build: #3303 failed Child of SCT-STASK-607

Build result summary

Details

Completed
Duration
2 minutes
Labels
None
Agent
bamboo-24.af.pivotal.io
Revision
b949185201dc9dd990a5f006b483bbaaff50d58d b949185201dc9dd990a5f006b483bbaaff50d58d
Total tests
720
Fixed in
#3304 (Manual run by Janne Valkealahti)

Tests

Responsible

No one has taken responsibility for this failure

Tests

New test failures 290
Status Test View job Duration
Collapse Failed TabOnTapCompletionProviderTests testAppNamesAfterStreamNameWithDotAfterStreamName History
Build and install SCDF < 1 sec
java.lang.IllegalStateException: Failed to load ApplicationContext
Caused by: org.springframework.beans.factory.BeanCreationException: Error creating bean with name 'flyway' defined in class path resource [org/springframework/boot/autoconfigure/flyway/FlywayAutoConfiguration$FlywayConfiguration.class]: Bean instantiation via factory method failed; nested exception is org.springframework.beans.BeanInstantiationException: Failed to instantiate [org.flywaydb.core.Flyway]: Factory method 'flyway' threw exception; nested exception is java.lang.BootstrapMethodError: java.lang.NoSuchMethodError: 
Caused by: org.springframework.beans.BeanInstantiationException: Failed to instantiate [org.flywaydb.core.Flyway]: Factory method 'flyway' threw exception; nested exception is java.lang.BootstrapMethodError: java.lang.NoSuchMethodError: 
Caused by: java.lang.BootstrapMethodError: java.lang.NoSuchMethodError: 
Caused by: java.lang.NoSuchMethodError: 
Collapse Failed TabOnTapCompletionProviderTests testAppNamesAfterStreamName History
Build and install SCDF < 1 sec
java.lang.IllegalStateException: Failed to load ApplicationContext
Caused by: org.springframework.beans.factory.BeanCreationException: Error creating bean with name 'flyway' defined in class path resource [org/springframework/boot/autoconfigure/flyway/FlywayAutoConfiguration$FlywayConfiguration.class]: Bean instantiation via factory method failed; nested exception is org.springframework.beans.BeanInstantiationException: Failed to instantiate [org.flywaydb.core.Flyway]: Factory method 'flyway' threw exception; nested exception is java.lang.BootstrapMethodError: java.lang.NoSuchMethodError: 
Caused by: org.springframework.beans.BeanInstantiationException: Failed to instantiate [org.flywaydb.core.Flyway]: Factory method 'flyway' threw exception; nested exception is java.lang.BootstrapMethodError: java.lang.NoSuchMethodError: 
Caused by: java.lang.BootstrapMethodError: java.lang.NoSuchMethodError: 
Caused by: java.lang.NoSuchMethodError: 
Collapse Failed TabOnTapCompletionProviderTests testStreamNameAfterColon History
Build and install SCDF < 1 sec
java.lang.IllegalStateException: Failed to load ApplicationContext
Caused by: org.springframework.beans.factory.BeanCreationException: Error creating bean with name 'flyway' defined in class path resource [org/springframework/boot/autoconfigure/flyway/FlywayAutoConfiguration$FlywayConfiguration.class]: Bean instantiation via factory method failed; nested exception is org.springframework.beans.BeanInstantiationException: Failed to instantiate [org.flywaydb.core.Flyway]: Factory method 'flyway' threw exception; nested exception is java.lang.BootstrapMethodError: java.lang.NoSuchMethodError: 
Caused by: org.springframework.beans.BeanInstantiationException: Failed to instantiate [org.flywaydb.core.Flyway]: Factory method 'flyway' threw exception; nested exception is java.lang.BootstrapMethodError: java.lang.NoSuchMethodError: 
Caused by: java.lang.BootstrapMethodError: java.lang.NoSuchMethodError: 
Caused by: java.lang.NoSuchMethodError: 
Collapse Failed AboutControllerTests testListApplications History
Build and install SCDF < 1 sec
java.lang.IllegalStateException: Failed to load ApplicationContext
Caused by: org.springframework.beans.factory.BeanCreationException: Error creating bean with name 'flyway' defined in class path resource [org/springframework/boot/autoconfigure/flyway/FlywayAutoConfiguration$FlywayConfiguration.class]: Bean instantiation via factory method failed; nested exception is org.springframework.beans.BeanInstantiationException: Failed to instantiate [org.flywaydb.core.Flyway]: Factory method 'flyway' threw exception; nested exception is java.lang.BootstrapMethodError: java.lang.NoSuchMethodError: 
Caused by: org.springframework.beans.BeanInstantiationException: Failed to instantiate [org.flywaydb.core.Flyway]: Factory method 'flyway' threw exception; nested exception is java.lang.BootstrapMethodError: java.lang.NoSuchMethodError: 
Caused by: java.lang.BootstrapMethodError: java.lang.NoSuchMethodError: 
Caused by: java.lang.NoSuchMethodError: 
Collapse Failed AboutControllerTests$AboutTests testAbout History
Build and install SCDF < 1 sec
java.lang.IllegalStateException: Failed to load ApplicationContext
Caused by: org.springframework.beans.factory.BeanCreationException: Error creating bean with name 'flyway' defined in class path resource [org/springframework/boot/autoconfigure/flyway/FlywayAutoConfiguration$FlywayConfiguration.class]: Bean instantiation via factory method failed; nested exception is org.springframework.beans.BeanInstantiationException: Failed to instantiate [org.flywaydb.core.Flyway]: Factory method 'flyway' threw exception; nested exception is java.lang.BootstrapMethodError: java.lang.NoSuchMethodError: 
Caused by: org.springframework.beans.BeanInstantiationException: Failed to instantiate [org.flywaydb.core.Flyway]: Factory method 'flyway' threw exception; nested exception is java.lang.BootstrapMethodError: java.lang.NoSuchMethodError: 
Caused by: java.lang.BootstrapMethodError: java.lang.NoSuchMethodError: 
Caused by: java.lang.NoSuchMethodError: 
Collapse Failed AboutControllerTests$AboutTests testAboutWithMissingSkipper History
Build and install SCDF < 1 sec
java.lang.IllegalStateException: Failed to load ApplicationContext
Caused by: org.springframework.beans.factory.BeanCreationException: Error creating bean with name 'flyway' defined in class path resource [org/springframework/boot/autoconfigure/flyway/FlywayAutoConfiguration$FlywayConfiguration.class]: Bean instantiation via factory method failed; nested exception is org.springframework.beans.BeanInstantiationException: Failed to instantiate [org.flywaydb.core.Flyway]: Factory method 'flyway' threw exception; nested exception is java.lang.BootstrapMethodError: java.lang.NoSuchMethodError: 
Caused by: org.springframework.beans.BeanInstantiationException: Failed to instantiate [org.flywaydb.core.Flyway]: Factory method 'flyway' threw exception; nested exception is java.lang.BootstrapMethodError: java.lang.NoSuchMethodError: 
Caused by: java.lang.BootstrapMethodError: java.lang.NoSuchMethodError: 
Caused by: java.lang.NoSuchMethodError: 
Collapse Failed AboutControllerTests$ChecksumDisabledTests testChecksumDisabled History
Build and install SCDF < 1 sec
java.lang.IllegalStateException: Failed to load ApplicationContext
Caused by: org.springframework.beans.factory.BeanCreationException: Error creating bean with name 'flyway' defined in class path resource [org/springframework/boot/autoconfigure/flyway/FlywayAutoConfiguration$FlywayConfiguration.class]: Bean instantiation via factory method failed; nested exception is org.springframework.beans.BeanInstantiationException: Failed to instantiate [org.flywaydb.core.Flyway]: Factory method 'flyway' threw exception; nested exception is java.lang.BootstrapMethodError: java.lang.NoSuchMethodError: 
Caused by: org.springframework.beans.BeanInstantiationException: Failed to instantiate [org.flywaydb.core.Flyway]: Factory method 'flyway' threw exception; nested exception is java.lang.BootstrapMethodError: java.lang.NoSuchMethodError: 
Caused by: java.lang.BootstrapMethodError: java.lang.NoSuchMethodError: 
Caused by: java.lang.NoSuchMethodError: 
Collapse Failed AboutControllerTests$ChecksumNoDefaultTests testChecksumNoDefaults History
Build and install SCDF < 1 sec
java.lang.IllegalStateException: Failed to load ApplicationContext
Caused by: org.springframework.beans.factory.BeanCreationException: Error creating bean with name 'flyway' defined in class path resource [org/springframework/boot/autoconfigure/flyway/FlywayAutoConfiguration$FlywayConfiguration.class]: Bean instantiation via factory method failed; nested exception is org.springframework.beans.BeanInstantiationException: Failed to instantiate [org.flywaydb.core.Flyway]: Factory method 'flyway' threw exception; nested exception is java.lang.BootstrapMethodError: java.lang.NoSuchMethodError: 
Caused by: org.springframework.beans.BeanInstantiationException: Failed to instantiate [org.flywaydb.core.Flyway]: Factory method 'flyway' threw exception; nested exception is java.lang.BootstrapMethodError: java.lang.NoSuchMethodError: 
Caused by: java.lang.BootstrapMethodError: java.lang.NoSuchMethodError: 
Caused by: java.lang.NoSuchMethodError: 
Collapse Failed AboutControllerTests$GAUrlTests testGA History
Build and install SCDF < 1 sec
java.lang.IllegalStateException: Failed to load ApplicationContext
Caused by: org.springframework.beans.factory.BeanCreationException: Error creating bean with name 'flyway' defined in class path resource [org/springframework/boot/autoconfigure/flyway/FlywayAutoConfiguration$FlywayConfiguration.class]: Bean instantiation via factory method failed; nested exception is org.springframework.beans.BeanInstantiationException: Failed to instantiate [org.flywaydb.core.Flyway]: Factory method 'flyway' threw exception; nested exception is java.lang.BootstrapMethodError: java.lang.NoSuchMethodError: 
Caused by: org.springframework.beans.BeanInstantiationException: Failed to instantiate [org.flywaydb.core.Flyway]: Factory method 'flyway' threw exception; nested exception is java.lang.BootstrapMethodError: java.lang.NoSuchMethodError: 
Caused by: java.lang.BootstrapMethodError: java.lang.NoSuchMethodError: 
Caused by: java.lang.NoSuchMethodError: 
Collapse Failed AboutControllerTests$MilestoneUrlTests testMilestone History
Build and install SCDF < 1 sec
java.lang.IllegalStateException: Failed to load ApplicationContext
Caused by: org.springframework.beans.factory.BeanCreationException: Error creating bean with name 'flyway' defined in class path resource [org/springframework/boot/autoconfigure/flyway/FlywayAutoConfiguration$FlywayConfiguration.class]: Bean instantiation via factory method failed; nested exception is org.springframework.beans.BeanInstantiationException: Failed to instantiate [org.flywaydb.core.Flyway]: Factory method 'flyway' threw exception; nested exception is java.lang.BootstrapMethodError: java.lang.NoSuchMethodError: 
Caused by: org.springframework.beans.BeanInstantiationException: Failed to instantiate [org.flywaydb.core.Flyway]: Factory method 'flyway' threw exception; nested exception is java.lang.BootstrapMethodError: java.lang.NoSuchMethodError: 
Caused by: java.lang.BootstrapMethodError: java.lang.NoSuchMethodError: 
Caused by: java.lang.NoSuchMethodError: 
Collapse Failed AboutControllerTests$RCUrlTests testRC History
Build and install SCDF < 1 sec
java.lang.IllegalStateException: Failed to load ApplicationContext
Caused by: org.springframework.beans.factory.BeanCreationException: Error creating bean with name 'flyway' defined in class path resource [org/springframework/boot/autoconfigure/flyway/FlywayAutoConfiguration$FlywayConfiguration.class]: Bean instantiation via factory method failed; nested exception is org.springframework.beans.BeanInstantiationException: Failed to instantiate [org.flywaydb.core.Flyway]: Factory method 'flyway' threw exception; nested exception is java.lang.BootstrapMethodError: java.lang.NoSuchMethodError: 
Caused by: org.springframework.beans.BeanInstantiationException: Failed to instantiate [org.flywaydb.core.Flyway]: Factory method 'flyway' threw exception; nested exception is java.lang.BootstrapMethodError: java.lang.NoSuchMethodError: 
Caused by: java.lang.BootstrapMethodError: java.lang.NoSuchMethodError: 
Caused by: java.lang.NoSuchMethodError: 
Collapse Failed AboutControllerTests$ReleaseUrlTests testRelease History
Build and install SCDF < 1 sec
java.lang.IllegalStateException: Failed to load ApplicationContext
Caused by: org.springframework.beans.factory.BeanCreationException: Error creating bean with name 'flyway' defined in class path resource [org/springframework/boot/autoconfigure/flyway/FlywayAutoConfiguration$FlywayConfiguration.class]: Bean instantiation via factory method failed; nested exception is org.springframework.beans.BeanInstantiationException: Failed to instantiate [org.flywaydb.core.Flyway]: Factory method 'flyway' threw exception; nested exception is java.lang.BootstrapMethodError: java.lang.NoSuchMethodError: 
Caused by: org.springframework.beans.BeanInstantiationException: Failed to instantiate [org.flywaydb.core.Flyway]: Factory method 'flyway' threw exception; nested exception is java.lang.BootstrapMethodError: java.lang.NoSuchMethodError: 
Caused by: java.lang.BootstrapMethodError: java.lang.NoSuchMethodError: 
Caused by: java.lang.NoSuchMethodError: 
Collapse Failed AppRegistryControllerTests testListApplications History
Build and install SCDF < 1 sec
java.lang.IllegalStateException: Failed to load ApplicationContext
Caused by: org.springframework.beans.factory.BeanCreationException: Error creating bean with name 'flyway' defined in class path resource [org/springframework/boot/autoconfigure/flyway/FlywayAutoConfiguration$FlywayConfiguration.class]: Bean instantiation via factory method failed; nested exception is org.springframework.beans.BeanInstantiationException: Failed to instantiate [org.flywaydb.core.Flyway]: Factory method 'flyway' threw exception; nested exception is java.lang.BootstrapMethodError: java.lang.NoSuchMethodError: 
Caused by: org.springframework.beans.BeanInstantiationException: Failed to instantiate [org.flywaydb.core.Flyway]: Factory method 'flyway' threw exception; nested exception is java.lang.BootstrapMethodError: java.lang.NoSuchMethodError: 
Caused by: java.lang.BootstrapMethodError: java.lang.NoSuchMethodError: 
Caused by: java.lang.NoSuchMethodError: 
Collapse Failed AppRegistryControllerTests testRegisterInvalidAppUri History
Build and install SCDF < 1 sec
java.lang.IllegalStateException: Failed to load ApplicationContext
Caused by: org.springframework.beans.factory.BeanCreationException: Error creating bean with name 'flyway' defined in class path resource [org/springframework/boot/autoconfigure/flyway/FlywayAutoConfiguration$FlywayConfiguration.class]: Bean instantiation via factory method failed; nested exception is org.springframework.beans.BeanInstantiationException: Failed to instantiate [org.flywaydb.core.Flyway]: Factory method 'flyway' threw exception; nested exception is java.lang.BootstrapMethodError: java.lang.NoSuchMethodError: 
Caused by: org.springframework.beans.BeanInstantiationException: Failed to instantiate [org.flywaydb.core.Flyway]: Factory method 'flyway' threw exception; nested exception is java.lang.BootstrapMethodError: java.lang.NoSuchMethodError: 
Caused by: java.lang.BootstrapMethodError: java.lang.NoSuchMethodError: 
Caused by: java.lang.NoSuchMethodError: 
Collapse Failed AppRegistryControllerTests testVersionWithMismatchBaseUri History
Build and install SCDF < 1 sec
java.lang.IllegalStateException: Failed to load ApplicationContext
Caused by: org.springframework.beans.factory.BeanCreationException: Error creating bean with name 'flyway' defined in class path resource [org/springframework/boot/autoconfigure/flyway/FlywayAutoConfiguration$FlywayConfiguration.class]: Bean instantiation via factory method failed; nested exception is org.springframework.beans.BeanInstantiationException: Failed to instantiate [org.flywaydb.core.Flyway]: Factory method 'flyway' threw exception; nested exception is java.lang.BootstrapMethodError: java.lang.NoSuchMethodError: 
Caused by: org.springframework.beans.BeanInstantiationException: Failed to instantiate [org.flywaydb.core.Flyway]: Factory method 'flyway' threw exception; nested exception is java.lang.BootstrapMethodError: java.lang.NoSuchMethodError: 
Caused by: java.lang.BootstrapMethodError: java.lang.NoSuchMethodError: 
Caused by: java.lang.NoSuchMethodError: 
Collapse Failed AppRegistryControllerTests testUnregisterApplication History
Build and install SCDF < 1 sec
java.lang.IllegalStateException: Failed to load ApplicationContext
Caused by: org.springframework.beans.factory.BeanCreationException: Error creating bean with name 'flyway' defined in class path resource [org/springframework/boot/autoconfigure/flyway/FlywayAutoConfiguration$FlywayConfiguration.class]: Bean instantiation via factory method failed; nested exception is org.springframework.beans.BeanInstantiationException: Failed to instantiate [org.flywaydb.core.Flyway]: Factory method 'flyway' threw exception; nested exception is java.lang.BootstrapMethodError: java.lang.NoSuchMethodError: 
Caused by: org.springframework.beans.BeanInstantiationException: Failed to instantiate [org.flywaydb.core.Flyway]: Factory method 'flyway' threw exception; nested exception is java.lang.BootstrapMethodError: java.lang.NoSuchMethodError: 
Caused by: java.lang.BootstrapMethodError: java.lang.NoSuchMethodError: 
Caused by: java.lang.NoSuchMethodError: 
Collapse Failed AppRegistryControllerTests testUnregisterApplicationNotFound History
Build and install SCDF < 1 sec
java.lang.IllegalStateException: Failed to load ApplicationContext
Caused by: org.springframework.beans.factory.BeanCreationException: Error creating bean with name 'flyway' defined in class path resource [org/springframework/boot/autoconfigure/flyway/FlywayAutoConfiguration$FlywayConfiguration.class]: Bean instantiation via factory method failed; nested exception is org.springframework.beans.BeanInstantiationException: Failed to instantiate [org.flywaydb.core.Flyway]: Factory method 'flyway' threw exception; nested exception is java.lang.BootstrapMethodError: java.lang.NoSuchMethodError: 
Caused by: org.springframework.beans.BeanInstantiationException: Failed to instantiate [org.flywaydb.core.Flyway]: Factory method 'flyway' threw exception; nested exception is java.lang.BootstrapMethodError: java.lang.NoSuchMethodError: 
Caused by: java.lang.BootstrapMethodError: java.lang.NoSuchMethodError: 
Caused by: java.lang.NoSuchMethodError: 
Collapse Failed AppRegistryControllerTests testUnregisterApplicationUsedInStream History
Build and install SCDF < 1 sec
java.lang.IllegalStateException: Failed to load ApplicationContext
Caused by: org.springframework.beans.factory.BeanCreationException: Error creating bean with name 'flyway' defined in class path resource [org/springframework/boot/autoconfigure/flyway/FlywayAutoConfiguration$FlywayConfiguration.class]: Bean instantiation via factory method failed; nested exception is org.springframework.beans.BeanInstantiationException: Failed to instantiate [org.flywaydb.core.Flyway]: Factory method 'flyway' threw exception; nested exception is java.lang.BootstrapMethodError: java.lang.NoSuchMethodError: 
Caused by: org.springframework.beans.BeanInstantiationException: Failed to instantiate [org.flywaydb.core.Flyway]: Factory method 'flyway' threw exception; nested exception is java.lang.BootstrapMethodError: java.lang.NoSuchMethodError: 
Caused by: java.lang.BootstrapMethodError: java.lang.NoSuchMethodError: 
Caused by: java.lang.NoSuchMethodError: 
Collapse Failed AppRegistryControllerTests testRegisterAllFromFile History
Build and install SCDF < 1 sec
java.lang.IllegalStateException: Failed to load ApplicationContext
Caused by: org.springframework.beans.factory.BeanCreationException: Error creating bean with name 'flyway' defined in class path resource [org/springframework/boot/autoconfigure/flyway/FlywayAutoConfiguration$FlywayConfiguration.class]: Bean instantiation via factory method failed; nested exception is org.springframework.beans.BeanInstantiationException: Failed to instantiate [org.flywaydb.core.Flyway]: Factory method 'flyway' threw exception; nested exception is java.lang.BootstrapMethodError: java.lang.NoSuchMethodError: 
Caused by: org.springframework.beans.BeanInstantiationException: Failed to instantiate [org.flywaydb.core.Flyway]: Factory method 'flyway' threw exception; nested exception is java.lang.BootstrapMethodError: java.lang.NoSuchMethodError: 
Caused by: java.lang.BootstrapMethodError: java.lang.NoSuchMethodError: 
Caused by: java.lang.NoSuchMethodError: 
Collapse Failed AppRegistryControllerTests testUnregisterApplicationUsedInStreamNotDeployed History
Build and install SCDF < 1 sec
java.lang.IllegalStateException: Failed to load ApplicationContext
Caused by: org.springframework.beans.factory.BeanCreationException: Error creating bean with name 'flyway' defined in class path resource [org/springframework/boot/autoconfigure/flyway/FlywayAutoConfiguration$FlywayConfiguration.class]: Bean instantiation via factory method failed; nested exception is org.springframework.beans.BeanInstantiationException: Failed to instantiate [org.flywaydb.core.Flyway]: Factory method 'flyway' threw exception; nested exception is java.lang.BootstrapMethodError: java.lang.NoSuchMethodError: 
Caused by: org.springframework.beans.BeanInstantiationException: Failed to instantiate [org.flywaydb.core.Flyway]: Factory method 'flyway' threw exception; nested exception is java.lang.BootstrapMethodError: java.lang.NoSuchMethodError: 
Caused by: java.lang.BootstrapMethodError: java.lang.NoSuchMethodError: 
Caused by: java.lang.NoSuchMethodError: 
Collapse Failed AppRegistryControllerTests testRegisterAllWithBadApplication History
Build and install SCDF < 1 sec
java.lang.IllegalStateException: Failed to load ApplicationContext
Caused by: org.springframework.beans.factory.BeanCreationException: Error creating bean with name 'flyway' defined in class path resource [org/springframework/boot/autoconfigure/flyway/FlywayAutoConfiguration$FlywayConfiguration.class]: Bean instantiation via factory method failed; nested exception is org.springframework.beans.BeanInstantiationException: Failed to instantiate [org.flywaydb.core.Flyway]: Factory method 'flyway' threw exception; nested exception is java.lang.BootstrapMethodError: java.lang.NoSuchMethodError: 
Caused by: org.springframework.beans.BeanInstantiationException: Failed to instantiate [org.flywaydb.core.Flyway]: Factory method 'flyway' threw exception; nested exception is java.lang.BootstrapMethodError: java.lang.NoSuchMethodError: 
Caused by: java.lang.BootstrapMethodError: java.lang.NoSuchMethodError: 
Caused by: java.lang.NoSuchMethodError: 
Collapse Failed AppRegistryControllerTests testDefaultVersion History
Build and install SCDF < 1 sec
java.lang.IllegalStateException: Failed to load ApplicationContext
Caused by: org.springframework.beans.factory.BeanCreationException: Error creating bean with name 'flyway' defined in class path resource [org/springframework/boot/autoconfigure/flyway/FlywayAutoConfiguration$FlywayConfiguration.class]: Bean instantiation via factory method failed; nested exception is org.springframework.beans.BeanInstantiationException: Failed to instantiate [org.flywaydb.core.Flyway]: Factory method 'flyway' threw exception; nested exception is java.lang.BootstrapMethodError: java.lang.NoSuchMethodError: 
Caused by: org.springframework.beans.BeanInstantiationException: Failed to instantiate [org.flywaydb.core.Flyway]: Factory method 'flyway' threw exception; nested exception is java.lang.BootstrapMethodError: java.lang.NoSuchMethodError: 
Caused by: java.lang.BootstrapMethodError: java.lang.NoSuchMethodError: 
Caused by: java.lang.NoSuchMethodError: 
Collapse Failed AppRegistryControllerTests testRegisterAll History
Build and install SCDF < 1 sec
java.lang.IllegalStateException: Failed to load ApplicationContext
Caused by: org.springframework.beans.factory.BeanCreationException: Error creating bean with name 'flyway' defined in class path resource [org/springframework/boot/autoconfigure/flyway/FlywayAutoConfiguration$FlywayConfiguration.class]: Bean instantiation via factory method failed; nested exception is org.springframework.beans.BeanInstantiationException: Failed to instantiate [org.flywaydb.core.Flyway]: Factory method 'flyway' threw exception; nested exception is java.lang.BootstrapMethodError: java.lang.NoSuchMethodError: 
Caused by: org.springframework.beans.BeanInstantiationException: Failed to instantiate [org.flywaydb.core.Flyway]: Factory method 'flyway' threw exception; nested exception is java.lang.BootstrapMethodError: java.lang.NoSuchMethodError: 
Caused by: java.lang.BootstrapMethodError: java.lang.NoSuchMethodError: 
Caused by: java.lang.NoSuchMethodError: 
Collapse Failed AppRegistryControllerTests testAppInfoNonExistingVersionedApp History
Build and install SCDF < 1 sec
java.lang.IllegalStateException: Failed to load ApplicationContext
Caused by: org.springframework.beans.factory.BeanCreationException: Error creating bean with name 'flyway' defined in class path resource [org/springframework/boot/autoconfigure/flyway/FlywayAutoConfiguration$FlywayConfiguration.class]: Bean instantiation via factory method failed; nested exception is org.springframework.beans.BeanInstantiationException: Failed to instantiate [org.flywaydb.core.Flyway]: Factory method 'flyway' threw exception; nested exception is java.lang.BootstrapMethodError: java.lang.NoSuchMethodError: 
Caused by: org.springframework.beans.BeanInstantiationException: Failed to instantiate [org.flywaydb.core.Flyway]: Factory method 'flyway' threw exception; nested exception is java.lang.BootstrapMethodError: java.lang.NoSuchMethodError: 
Caused by: java.lang.BootstrapMethodError: java.lang.NoSuchMethodError: 
Caused by: java.lang.NoSuchMethodError: 
Collapse Failed AppRegistryControllerTests testListApplicationsBySearch History
Build and install SCDF < 1 sec
java.lang.IllegalStateException: Failed to load ApplicationContext
Caused by: org.springframework.beans.factory.BeanCreationException: Error creating bean with name 'flyway' defined in class path resource [org/springframework/boot/autoconfigure/flyway/FlywayAutoConfiguration$FlywayConfiguration.class]: Bean instantiation via factory method failed; nested exception is org.springframework.beans.BeanInstantiationException: Failed to instantiate [org.flywaydb.core.Flyway]: Factory method 'flyway' threw exception; nested exception is java.lang.BootstrapMethodError: java.lang.NoSuchMethodError: 
Caused by: org.springframework.beans.BeanInstantiationException: Failed to instantiate [org.flywaydb.core.Flyway]: Factory method 'flyway' threw exception; nested exception is java.lang.BootstrapMethodError: java.lang.NoSuchMethodError: 
Caused by: java.lang.BootstrapMethodError: java.lang.NoSuchMethodError: 
Caused by: java.lang.NoSuchMethodError: 
Collapse Failed AppRegistryControllerTests testListApplicationsByTypeAndSearch History
Build and install SCDF < 1 sec
java.lang.IllegalStateException: Failed to load ApplicationContext
Caused by: org.springframework.beans.factory.BeanCreationException: Error creating bean with name 'flyway' defined in class path resource [org/springframework/boot/autoconfigure/flyway/FlywayAutoConfiguration$FlywayConfiguration.class]: Bean instantiation via factory method failed; nested exception is org.springframework.beans.BeanInstantiationException: Failed to instantiate [org.flywaydb.core.Flyway]: Factory method 'flyway' threw exception; nested exception is java.lang.BootstrapMethodError: java.lang.NoSuchMethodError: 
Caused by: org.springframework.beans.BeanInstantiationException: Failed to instantiate [org.flywaydb.core.Flyway]: Factory method 'flyway' threw exception; nested exception is java.lang.BootstrapMethodError: java.lang.NoSuchMethodError: 
Caused by: java.lang.BootstrapMethodError: java.lang.NoSuchMethodError: 
Caused by: java.lang.NoSuchMethodError: 
Collapse Failed AppRegistryControllerTests testRegisterApplicationTwice History
Build and install SCDF < 1 sec
java.lang.IllegalStateException: Failed to load ApplicationContext
Caused by: org.springframework.beans.factory.BeanCreationException: Error creating bean with name 'flyway' defined in class path resource [org/springframework/boot/autoconfigure/flyway/FlywayAutoConfiguration$FlywayConfiguration.class]: Bean instantiation via factory method failed; nested exception is org.springframework.beans.BeanInstantiationException: Failed to instantiate [org.flywaydb.core.Flyway]: Factory method 'flyway' threw exception; nested exception is java.lang.BootstrapMethodError: java.lang.NoSuchMethodError: 
Caused by: org.springframework.beans.BeanInstantiationException: Failed to instantiate [org.flywaydb.core.Flyway]: Factory method 'flyway' threw exception; nested exception is java.lang.BootstrapMethodError: java.lang.NoSuchMethodError: 
Caused by: java.lang.BootstrapMethodError: java.lang.NoSuchMethodError: 
Caused by: java.lang.NoSuchMethodError: 
Collapse Failed AppRegistryControllerTests testRegisterAllWithoutForce History
Build and install SCDF < 1 sec
java.lang.IllegalStateException: Failed to load ApplicationContext
Caused by: org.springframework.beans.factory.BeanCreationException: Error creating bean with name 'flyway' defined in class path resource [org/springframework/boot/autoconfigure/flyway/FlywayAutoConfiguration$FlywayConfiguration.class]: Bean instantiation via factory method failed; nested exception is org.springframework.beans.BeanInstantiationException: Failed to instantiate [org.flywaydb.core.Flyway]: Factory method 'flyway' threw exception; nested exception is java.lang.BootstrapMethodError: java.lang.NoSuchMethodError: 
Caused by: org.springframework.beans.BeanInstantiationException: Failed to instantiate [org.flywaydb.core.Flyway]: Factory method 'flyway' threw exception; nested exception is java.lang.BootstrapMethodError: java.lang.NoSuchMethodError: 
Caused by: java.lang.BootstrapMethodError: java.lang.NoSuchMethodError: 
Caused by: java.lang.NoSuchMethodError: 
Collapse Failed AppRegistryControllerTests testVersionOverrideNonExistentApp History
Build and install SCDF < 1 sec
java.lang.IllegalStateException: Failed to load ApplicationContext
Caused by: org.springframework.beans.factory.BeanCreationException: Error creating bean with name 'flyway' defined in class path resource [org/springframework/boot/autoconfigure/flyway/FlywayAutoConfiguration$FlywayConfiguration.class]: Bean instantiation via factory method failed; nested exception is org.springframework.beans.BeanInstantiationException: Failed to instantiate [org.flywaydb.core.Flyway]: Factory method 'flyway' threw exception; nested exception is java.lang.BootstrapMethodError: java.lang.NoSuchMethodError: 
Caused by: org.springframework.beans.BeanInstantiationException: Failed to instantiate [org.flywaydb.core.Flyway]: Factory method 'flyway' threw exception; nested exception is java.lang.BootstrapMethodError: java.lang.NoSuchMethodError: 
Caused by: java.lang.BootstrapMethodError: java.lang.NoSuchMethodError: 
Caused by: java.lang.NoSuchMethodError: 
Collapse Failed AppRegistryControllerTests testListSingleApplicationExhaustive History
Build and install SCDF < 1 sec
java.lang.IllegalStateException: Failed to load ApplicationContext
Caused by: org.springframework.beans.factory.BeanCreationException: Error creating bean with name 'flyway' defined in class path resource [org/springframework/boot/autoconfigure/flyway/FlywayAutoConfiguration$FlywayConfiguration.class]: Bean instantiation via factory method failed; nested exception is org.springframework.beans.BeanInstantiationException: Failed to instantiate [org.flywaydb.core.Flyway]: Factory method 'flyway' threw exception; nested exception is java.lang.BootstrapMethodError: java.lang.NoSuchMethodError: 
Caused by: org.springframework.beans.BeanInstantiationException: Failed to instantiate [org.flywaydb.core.Flyway]: Factory method 'flyway' threw exception; nested exception is java.lang.BootstrapMethodError: java.lang.NoSuchMethodError: 
Caused by: java.lang.BootstrapMethodError: java.lang.NoSuchMethodError: 
Caused by: java.lang.NoSuchMethodError: 
Collapse Failed AppRegistryControllerTests testRegisterVersionedApp History
Build and install SCDF < 1 sec
java.lang.IllegalStateException: Failed to load ApplicationContext
Caused by: org.springframework.beans.factory.BeanCreationException: Error creating bean with name 'flyway' defined in class path resource [org/springframework/boot/autoconfigure/flyway/FlywayAutoConfiguration$FlywayConfiguration.class]: Bean instantiation via factory method failed; nested exception is org.springframework.beans.BeanInstantiationException: Failed to instantiate [org.flywaydb.core.Flyway]: Factory method 'flyway' threw exception; nested exception is java.lang.BootstrapMethodError: java.lang.NoSuchMethodError: 
Caused by: org.springframework.beans.BeanInstantiationException: Failed to instantiate [org.flywaydb.core.Flyway]: Factory method 'flyway' threw exception; nested exception is java.lang.BootstrapMethodError: java.lang.NoSuchMethodError: 
Caused by: java.lang.BootstrapMethodError: java.lang.NoSuchMethodError: 
Caused by: java.lang.NoSuchMethodError: 
Collapse Failed AppRegistryControllerTests testFindNonExistentApp History
Build and install SCDF < 1 sec
java.lang.IllegalStateException: Failed to load ApplicationContext
Caused by: org.springframework.beans.factory.BeanCreationException: Error creating bean with name 'flyway' defined in class path resource [org/springframework/boot/autoconfigure/flyway/FlywayAutoConfiguration$FlywayConfiguration.class]: Bean instantiation via factory method failed; nested exception is org.springframework.beans.BeanInstantiationException: Failed to instantiate [org.flywaydb.core.Flyway]: Factory method 'flyway' threw exception; nested exception is java.lang.BootstrapMethodError: java.lang.NoSuchMethodError: 
Caused by: org.springframework.beans.BeanInstantiationException: Failed to instantiate [org.flywaydb.core.Flyway]: Factory method 'flyway' threw exception; nested exception is java.lang.BootstrapMethodError: java.lang.NoSuchMethodError: 
Caused by: java.lang.BootstrapMethodError: java.lang.NoSuchMethodError: 
Caused by: java.lang.NoSuchMethodError: 
Collapse Failed AppRegistryControllerTests testUnregisterUnversionedApplicationNotFound History
Build and install SCDF < 1 sec
java.lang.IllegalStateException: Failed to load ApplicationContext
Caused by: org.springframework.beans.factory.BeanCreationException: Error creating bean with name 'flyway' defined in class path resource [org/springframework/boot/autoconfigure/flyway/FlywayAutoConfiguration$FlywayConfiguration.class]: Bean instantiation via factory method failed; nested exception is org.springframework.beans.BeanInstantiationException: Failed to instantiate [org.flywaydb.core.Flyway]: Factory method 'flyway' threw exception; nested exception is java.lang.BootstrapMethodError: java.lang.NoSuchMethodError: 
Caused by: org.springframework.beans.BeanInstantiationException: Failed to instantiate [org.flywaydb.core.Flyway]: Factory method 'flyway' threw exception; nested exception is java.lang.BootstrapMethodError: java.lang.NoSuchMethodError: 
Caused by: java.lang.BootstrapMethodError: java.lang.NoSuchMethodError: 
Caused by: java.lang.NoSuchMethodError: 
Collapse Failed AppRegistryControllerTests testListApplicationsByType History
Build and install SCDF < 1 sec
java.lang.IllegalStateException: Failed to load ApplicationContext
Caused by: org.springframework.beans.factory.BeanCreationException: Error creating bean with name 'flyway' defined in class path resource [org/springframework/boot/autoconfigure/flyway/FlywayAutoConfiguration$FlywayConfiguration.class]: Bean instantiation via factory method failed; nested exception is org.springframework.beans.BeanInstantiationException: Failed to instantiate [org.flywaydb.core.Flyway]: Factory method 'flyway' threw exception; nested exception is java.lang.BootstrapMethodError: java.lang.NoSuchMethodError: 
Caused by: org.springframework.beans.BeanInstantiationException: Failed to instantiate [org.flywaydb.core.Flyway]: Factory method 'flyway' threw exception; nested exception is java.lang.BootstrapMethodError: java.lang.NoSuchMethodError: 
Caused by: java.lang.BootstrapMethodError: java.lang.NoSuchMethodError: 
Caused by: java.lang.NoSuchMethodError: 
Collapse Failed AppRegistryControllerTests testRegisterApp History
Build and install SCDF < 1 sec
java.lang.IllegalStateException: Failed to load ApplicationContext
Caused by: org.springframework.beans.factory.BeanCreationException: Error creating bean with name 'flyway' defined in class path resource [org/springframework/boot/autoconfigure/flyway/FlywayAutoConfiguration$FlywayConfiguration.class]: Bean instantiation via factory method failed; nested exception is org.springframework.beans.BeanInstantiationException: Failed to instantiate [org.flywaydb.core.Flyway]: Factory method 'flyway' threw exception; nested exception is java.lang.BootstrapMethodError: java.lang.NoSuchMethodError: 
Caused by: org.springframework.beans.BeanInstantiationException: Failed to instantiate [org.flywaydb.core.Flyway]: Factory method 'flyway' threw exception; nested exception is java.lang.BootstrapMethodError: java.lang.NoSuchMethodError: 
Caused by: java.lang.BootstrapMethodError: java.lang.NoSuchMethodError: 
Caused by: java.lang.NoSuchMethodError: 
Collapse Failed AppRegistryControllerTests testListSingleApplication History
Build and install SCDF < 1 sec
java.lang.IllegalStateException: Failed to load ApplicationContext
Caused by: org.springframework.beans.factory.BeanCreationException: Error creating bean with name 'flyway' defined in class path resource [org/springframework/boot/autoconfigure/flyway/FlywayAutoConfiguration$FlywayConfiguration.class]: Bean instantiation via factory method failed; nested exception is org.springframework.beans.BeanInstantiationException: Failed to instantiate [org.flywaydb.core.Flyway]: Factory method 'flyway' threw exception; nested exception is java.lang.BootstrapMethodError: java.lang.NoSuchMethodError: 
Caused by: org.springframework.beans.BeanInstantiationException: Failed to instantiate [org.flywaydb.core.Flyway]: Factory method 'flyway' threw exception; nested exception is java.lang.BootstrapMethodError: java.lang.NoSuchMethodError: 
Caused by: java.lang.BootstrapMethodError: java.lang.NoSuchMethodError: 
Caused by: java.lang.NoSuchMethodError: 
Collapse Failed AppRegistryControllerTests testUnregisterAllApplicationsWhenApplicationUsedInStream History
Build and install SCDF < 1 sec
java.lang.IllegalStateException: Failed to load ApplicationContext
Caused by: org.springframework.beans.factory.BeanCreationException: Error creating bean with name 'flyway' defined in class path resource [org/springframework/boot/autoconfigure/flyway/FlywayAutoConfiguration$FlywayConfiguration.class]: Bean instantiation via factory method failed; nested exception is org.springframework.beans.BeanInstantiationException: Failed to instantiate [org.flywaydb.core.Flyway]: Factory method 'flyway' threw exception; nested exception is java.lang.BootstrapMethodError: java.lang.NoSuchMethodError: 
Caused by: org.springframework.beans.BeanInstantiationException: Failed to instantiate [org.flywaydb.core.Flyway]: Factory method 'flyway' threw exception; nested exception is java.lang.BootstrapMethodError: java.lang.NoSuchMethodError: 
Caused by: java.lang.BootstrapMethodError: java.lang.NoSuchMethodError: 
Caused by: java.lang.NoSuchMethodError: 
Collapse Failed AppRegistryControllerTests testRegisterAllWithForce History
Build and install SCDF < 1 sec
java.lang.IllegalStateException: Failed to load ApplicationContext
Caused by: org.springframework.beans.factory.BeanCreationException: Error creating bean with name 'flyway' defined in class path resource [org/springframework/boot/autoconfigure/flyway/FlywayAutoConfiguration$FlywayConfiguration.class]: Bean instantiation via factory method failed; nested exception is org.springframework.beans.BeanInstantiationException: Failed to instantiate [org.flywaydb.core.Flyway]: Factory method 'flyway' threw exception; nested exception is java.lang.BootstrapMethodError: java.lang.NoSuchMethodError: 
Caused by: org.springframework.beans.BeanInstantiationException: Failed to instantiate [org.flywaydb.core.Flyway]: Factory method 'flyway' threw exception; nested exception is java.lang.BootstrapMethodError: java.lang.NoSuchMethodError: 
Caused by: java.lang.BootstrapMethodError: java.lang.NoSuchMethodError: 
Caused by: java.lang.NoSuchMethodError: 
Collapse Failed AppRegistryControllerTests testPagination History
Build and install SCDF < 1 sec
java.lang.IllegalStateException: Failed to load ApplicationContext
Caused by: org.springframework.beans.factory.BeanCreationException: Error creating bean with name 'flyway' defined in class path resource [org/springframework/boot/autoconfigure/flyway/FlywayAutoConfiguration$FlywayConfiguration.class]: Bean instantiation via factory method failed; nested exception is org.springframework.beans.BeanInstantiationException: Failed to instantiate [org.flywaydb.core.Flyway]: Factory method 'flyway' threw exception; nested exception is java.lang.BootstrapMethodError: java.lang.NoSuchMethodError: 
Caused by: org.springframework.beans.BeanInstantiationException: Failed to instantiate [org.flywaydb.core.Flyway]: Factory method 'flyway' threw exception; nested exception is java.lang.BootstrapMethodError: java.lang.NoSuchMethodError: 
Caused by: java.lang.BootstrapMethodError: java.lang.NoSuchMethodError: 
Caused by: java.lang.NoSuchMethodError: 
Collapse Failed AppRegistryControllerTests testAppInfoNonExistingApp History
Build and install SCDF < 1 sec
java.lang.IllegalStateException: Failed to load ApplicationContext
Caused by: org.springframework.beans.factory.BeanCreationException: Error creating bean with name 'flyway' defined in class path resource [org/springframework/boot/autoconfigure/flyway/FlywayAutoConfiguration$FlywayConfiguration.class]: Bean instantiation via factory method failed; nested exception is org.springframework.beans.BeanInstantiationException: Failed to instantiate [org.flywaydb.core.Flyway]: Factory method 'flyway' threw exception; nested exception is java.lang.BootstrapMethodError: java.lang.NoSuchMethodError: 
Caused by: org.springframework.beans.BeanInstantiationException: Failed to instantiate [org.flywaydb.core.Flyway]: Factory method 'flyway' threw exception; nested exception is java.lang.BootstrapMethodError: java.lang.NoSuchMethodError: 
Caused by: java.lang.BootstrapMethodError: java.lang.NoSuchMethodError: 
Caused by: java.lang.NoSuchMethodError: 
Collapse Failed AppRegistryControllerTests testVersionOverride History
Build and install SCDF < 1 sec
java.lang.IllegalStateException: Failed to load ApplicationContext
Caused by: org.springframework.beans.factory.BeanCreationException: Error creating bean with name 'flyway' defined in class path resource [org/springframework/boot/autoconfigure/flyway/FlywayAutoConfiguration$FlywayConfiguration.class]: Bean instantiation via factory method failed; nested exception is org.springframework.beans.BeanInstantiationException: Failed to instantiate [org.flywaydb.core.Flyway]: Factory method 'flyway' threw exception; nested exception is java.lang.BootstrapMethodError: java.lang.NoSuchMethodError: 
Caused by: org.springframework.beans.BeanInstantiationException: Failed to instantiate [org.flywaydb.core.Flyway]: Factory method 'flyway' threw exception; nested exception is java.lang.BootstrapMethodError: java.lang.NoSuchMethodError: 
Caused by: java.lang.BootstrapMethodError: java.lang.NoSuchMethodError: 
Caused by: java.lang.NoSuchMethodError: 
Collapse Failed AppRegistryControllerTests testRegisterAndListApplications History
Build and install SCDF < 1 sec
java.lang.IllegalStateException: Failed to load ApplicationContext
Caused by: org.springframework.beans.factory.BeanCreationException: Error creating bean with name 'flyway' defined in class path resource [org/springframework/boot/autoconfigure/flyway/FlywayAutoConfiguration$FlywayConfiguration.class]: Bean instantiation via factory method failed; nested exception is org.springframework.beans.BeanInstantiationException: Failed to instantiate [org.flywaydb.core.Flyway]: Factory method 'flyway' threw exception; nested exception is java.lang.BootstrapMethodError: java.lang.NoSuchMethodError: 
Caused by: org.springframework.beans.BeanInstantiationException: Failed to instantiate [org.flywaydb.core.Flyway]: Factory method 'flyway' threw exception; nested exception is java.lang.BootstrapMethodError: java.lang.NoSuchMethodError: 
Caused by: java.lang.BootstrapMethodError: java.lang.NoSuchMethodError: 
Caused by: java.lang.NoSuchMethodError: 
Collapse Failed AppRegistryControllerTests testUnregisterAllApplications History
Build and install SCDF < 1 sec
java.lang.IllegalStateException: Failed to load ApplicationContext
Caused by: org.springframework.beans.factory.BeanCreationException: Error creating bean with name 'flyway' defined in class path resource [org/springframework/boot/autoconfigure/flyway/FlywayAutoConfiguration$FlywayConfiguration.class]: Bean instantiation via factory method failed; nested exception is org.springframework.beans.BeanInstantiationException: Failed to instantiate [org.flywaydb.core.Flyway]: Factory method 'flyway' threw exception; nested exception is java.lang.BootstrapMethodError: java.lang.NoSuchMethodError: 
Caused by: org.springframework.beans.BeanInstantiationException: Failed to instantiate [org.flywaydb.core.Flyway]: Factory method 'flyway' threw exception; nested exception is java.lang.BootstrapMethodError: java.lang.NoSuchMethodError: 
Caused by: java.lang.BootstrapMethodError: java.lang.NoSuchMethodError: 
Caused by: java.lang.NoSuchMethodError: 
Collapse Failed AuditRecordControllerTests testVerifyNumberOfAuditRecords History
Build and install SCDF < 1 sec
java.lang.IllegalStateException: Failed to load ApplicationContext
Caused by: org.springframework.beans.factory.BeanCreationException: Error creating bean with name 'flyway' defined in class path resource [org/springframework/boot/autoconfigure/flyway/FlywayAutoConfiguration$FlywayConfiguration.class]: Bean instantiation via factory method failed; nested exception is org.springframework.beans.BeanInstantiationException: Failed to instantiate [org.flywaydb.core.Flyway]: Factory method 'flyway' threw exception; nested exception is java.lang.BootstrapMethodError: java.lang.NoSuchMethodError: 
Caused by: org.springframework.beans.BeanInstantiationException: Failed to instantiate [org.flywaydb.core.Flyway]: Factory method 'flyway' threw exception; nested exception is java.lang.BootstrapMethodError: java.lang.NoSuchMethodError: 
Caused by: java.lang.BootstrapMethodError: java.lang.NoSuchMethodError: 
Caused by: java.lang.NoSuchMethodError: 
Collapse Failed AuditRecordControllerTests testRetrieveAllAuditRecordsOrderByCorrelationIdDesc History
Build and install SCDF < 1 sec
java.lang.IllegalStateException: Failed to load ApplicationContext
Caused by: org.springframework.beans.factory.BeanCreationException: Error creating bean with name 'flyway' defined in class path resource [org/springframework/boot/autoconfigure/flyway/FlywayAutoConfiguration$FlywayConfiguration.class]: Bean instantiation via factory method failed; nested exception is org.springframework.beans.BeanInstantiationException: Failed to instantiate [org.flywaydb.core.Flyway]: Factory method 'flyway' threw exception; nested exception is java.lang.BootstrapMethodError: java.lang.NoSuchMethodError: 
Caused by: org.springframework.beans.BeanInstantiationException: Failed to instantiate [org.flywaydb.core.Flyway]: Factory method 'flyway' threw exception; nested exception is java.lang.BootstrapMethodError: java.lang.NoSuchMethodError: 
Caused by: java.lang.BootstrapMethodError: java.lang.NoSuchMethodError: 
Caused by: java.lang.NoSuchMethodError: 
Collapse Failed AuditRecordControllerTests testRetrievePagedAuditDataOverlappingRightBound History
Build and install SCDF < 1 sec
java.lang.IllegalStateException: Failed to load ApplicationContext
Caused by: org.springframework.beans.factory.BeanCreationException: Error creating bean with name 'flyway' defined in class path resource [org/springframework/boot/autoconfigure/flyway/FlywayAutoConfiguration$FlywayConfiguration.class]: Bean instantiation via factory method failed; nested exception is org.springframework.beans.BeanInstantiationException: Failed to instantiate [org.flywaydb.core.Flyway]: Factory method 'flyway' threw exception; nested exception is java.lang.BootstrapMethodError: java.lang.NoSuchMethodError: 
Caused by: org.springframework.beans.BeanInstantiationException: Failed to instantiate [org.flywaydb.core.Flyway]: Factory method 'flyway' threw exception; nested exception is java.lang.BootstrapMethodError: java.lang.NoSuchMethodError: 
Caused by: java.lang.BootstrapMethodError: java.lang.NoSuchMethodError: 
Caused by: java.lang.NoSuchMethodError: 
Collapse Failed AuditRecordControllerTests testRetrieveAllAuditRecordsOrderByCorrelationIdAsc History
Build and install SCDF < 1 sec
java.lang.IllegalStateException: Failed to load ApplicationContext
Caused by: org.springframework.beans.factory.BeanCreationException: Error creating bean with name 'flyway' defined in class path resource [org/springframework/boot/autoconfigure/flyway/FlywayAutoConfiguration$FlywayConfiguration.class]: Bean instantiation via factory method failed; nested exception is org.springframework.beans.BeanInstantiationException: Failed to instantiate [org.flywaydb.core.Flyway]: Factory method 'flyway' threw exception; nested exception is java.lang.BootstrapMethodError: java.lang.NoSuchMethodError: 
Caused by: org.springframework.beans.BeanInstantiationException: Failed to instantiate [org.flywaydb.core.Flyway]: Factory method 'flyway' threw exception; nested exception is java.lang.BootstrapMethodError: java.lang.NoSuchMethodError: 
Caused by: java.lang.BootstrapMethodError: java.lang.NoSuchMethodError: 
Caused by: java.lang.NoSuchMethodError: 
Collapse Failed AuditRecordControllerTests testRetrieveAllAuditRecordsWithOperationStream History
Build and install SCDF < 1 sec
java.lang.IllegalStateException: Failed to load ApplicationContext
Caused by: org.springframework.beans.factory.BeanCreationException: Error creating bean with name 'flyway' defined in class path resource [org/springframework/boot/autoconfigure/flyway/FlywayAutoConfiguration$FlywayConfiguration.class]: Bean instantiation via factory method failed; nested exception is org.springframework.beans.BeanInstantiationException: Failed to instantiate [org.flywaydb.core.Flyway]: Factory method 'flyway' threw exception; nested exception is java.lang.BootstrapMethodError: java.lang.NoSuchMethodError: 
Caused by: org.springframework.beans.BeanInstantiationException: Failed to instantiate [org.flywaydb.core.Flyway]: Factory method 'flyway' threw exception; nested exception is java.lang.BootstrapMethodError: java.lang.NoSuchMethodError: 
Caused by: java.lang.BootstrapMethodError: java.lang.NoSuchMethodError: 
Caused by: java.lang.NoSuchMethodError: 
Collapse Failed AuditRecordControllerTests testRetrieveRegisteredAppsAuditData History
Build and install SCDF < 1 sec
java.lang.IllegalStateException: Failed to load ApplicationContext
Caused by: org.springframework.beans.factory.BeanCreationException: Error creating bean with name 'flyway' defined in class path resource [org/springframework/boot/autoconfigure/flyway/FlywayAutoConfiguration$FlywayConfiguration.class]: Bean instantiation via factory method failed; nested exception is org.springframework.beans.BeanInstantiationException: Failed to instantiate [org.flywaydb.core.Flyway]: Factory method 'flyway' threw exception; nested exception is java.lang.BootstrapMethodError: java.lang.NoSuchMethodError: 
Caused by: org.springframework.beans.BeanInstantiationException: Failed to instantiate [org.flywaydb.core.Flyway]: Factory method 'flyway' threw exception; nested exception is java.lang.BootstrapMethodError: java.lang.NoSuchMethodError: 
Caused by: java.lang.BootstrapMethodError: java.lang.NoSuchMethodError: 
Caused by: java.lang.NoSuchMethodError: 
Collapse Failed AuditRecordControllerTests testRetrieveAuditRecordsFromNullToGivenDate History
Build and install SCDF < 1 sec
java.lang.IllegalStateException: Failed to load ApplicationContext
Caused by: org.springframework.beans.factory.BeanCreationException: Error creating bean with name 'flyway' defined in class path resource [org/springframework/boot/autoconfigure/flyway/FlywayAutoConfiguration$FlywayConfiguration.class]: Bean instantiation via factory method failed; nested exception is org.springframework.beans.BeanInstantiationException: Failed to instantiate [org.flywaydb.core.Flyway]: Factory method 'flyway' threw exception; nested exception is java.lang.BootstrapMethodError: java.lang.NoSuchMethodError: 
Caused by: org.springframework.beans.BeanInstantiationException: Failed to instantiate [org.flywaydb.core.Flyway]: Factory method 'flyway' threw exception; nested exception is java.lang.BootstrapMethodError: java.lang.NoSuchMethodError: 
Caused by: java.lang.BootstrapMethodError: java.lang.NoSuchMethodError: 
Caused by: java.lang.NoSuchMethodError: